program: Orca
programVersion: 5.0.2
elementType: O N N N C C C C C C C C C C C C C C C C C Cl H H H H H H H H H H H H H H H H H H H H H
charge: 1
multiplicity: 1
keywords: wb97x-d3
keywords: def2-TZVPP
keywords: def2/J RIJCOSX
keywords: DEFGRID2
keywords: scfconv7
keywords: smallprint printgap noloewdin
keywords: NOSOSCF
formula: C17H21ClN3O
InChI: InChI=1/C17H21ClN3O/c1-16(2)8-7-14(9-13-3-5-15(18)6-4-13)17(16,22)10-21-12-19-11-20-21/h3-6,9,11-12,20,22H,7-8,10H2,1-2H3
43 atoms
O  1.313457 -0.581284 1.446801
N  0.515128 1.813746 0.1856
N  -0.493724 1.523071 1.013478
N  -1.271899 2.872347 -0.506844
C  3.617666 -0.43868 0.540677
C  2.099777 -0.105429 0.383216
C  4.152364 -0.184288 -0.870759
C  1.773331 -0.643348 -1.005035
C  3.058783 -0.70597 -1.804015
C  1.89652 1.413679 0.412831
C  3.765245 -1.923674 0.887165
C  4.335579 0.383952 1.601508
C  0.602365 -0.991934 -1.53989
C  0.011729 2.631911 -0.723879
C  -1.561308 2.15689 0.569007
C  -0.76235 -0.981553 -0.977548
C  -3.390476 -0.907971 -0.049527
C  -1.729834 -0.202643 -1.613854
C  -1.162599 -1.766787 0.10283
C  -2.465338 -1.727801 0.57602
C  -3.036294 -0.151045 -1.154292
Cl -5.017595 -0.844795 0.54358
H  5.112203 -0.676245 -1.03264
H  4.318068 0.884401 -1.028163
H  3.258215 -1.737826 -2.100541
H  2.987903 -0.126901 -2.725546
H  2.474005 1.915947 -0.359077
H  2.193426 1.824737 1.377895
H  3.23675 -2.581868 0.193662
H  4.819731 -2.200545 0.853936
H  3.410162 -2.145885 1.89504
H  4.396454 1.442446 1.344579
H  3.852479 0.297065 2.576835
H  5.360241 0.026382 1.715175
H  1.29544 -1.544324 1.431295
H  0.6146 3.043754 -1.517625
H  -2.519729 2.083636 1.056611
H  -1.455546 0.389694 -2.478107
H  -0.466747 -2.449158 0.570692
H  -2.752398 -2.342601 1.418234
H  -3.762597 0.47708 -1.652086
H  0.637207 -1.286181 -2.587092
H  -0.384698 0.841722 1.7601
elementType: O N C Cl H
totalener: -1360.05708505 hartree
nucrepener: 2062.36936610 hartree
electener: -3422.42645114 hartree
oneelecener: -5931.88144576 hartree
twoeener: 2509.45499462 hartree
cpcmener: -0.11038609 hartree
kineticenergy: 1355.29432283 hartree
xcener: -109.921278672282 hartree
chargesum: 1.0000000
charge: -0.438560 0.076627 0.003522 -0.362111 0.245963 0.568883 -0.240578 -0.338137 -0.082933 -0.136567 -0.379281 -0.351462 -0.047924 0.159161 0.160685 0.004609 0.119121 -0.212167 -0.210409 -0.147872 -0.173957 -0.100587 0.082625 0.088132 0.103230 0.091368 0.135557 0.165329 0.115227 0.101689 0.100045 0.094409 0.102199 0.105178 0.238640 0.190638 0.206633 0.148943 0.148733 0.143921 0.144371 0.126819 0.250289
qa: -0.4386 0.0766 0.0035 -0.3621 0.2460 0.5689 -0.2406 -0.3381 -0.0829 -0.1366 -0.3793 -0.3515 -0.0479 0.1592 0.1607 0.0046 0.1191 -0.2122 -0.2104 -0.1479 -0.1740 -0.1006 0.0826 0.0881 0.1032 0.0914 0.1356 0.1653 0.1152 0.1017 0.1000 0.0944 0.1022 0.1052 0.2386 0.1906 0.2066 0.1489 0.1487 0.1439 0.1444 0.1268 0.2503
va: 2.0023 3.4268 3.4670 3.0015 3.7743 3.6266 4.0039 3.9290 3.8628 3.8647 3.9462 3.9008 3.7606 3.9952 3.9680 3.5794 3.7724 3.8488 3.9181 3.9968 3.9549 1.2031 1.0156 1.0091 1.0012 1.0132 0.9948 0.9856 0.9934 1.0053 1.0079 0.9993 1.0114 1.0021 1.0094 0.9843 0.9718 1.0052 1.0067 1.0067 1.0089 0.9999 0.9872
dispersion: -0.028314906 hartree
energy: -1360.085399951906 hartree
dipole: 41.27460 -38.56710 2.70750 -2.12269 3.92108 1.79839 0.14951 0.57873 0.72824
magnitude: 3.33093 au
magnitude: 8.46656 debye
