program: Orca
programVersion: 5.0.2
elementType: O N N N C C C C C C C C C C C C C C C C C Cl H H H H H H H H H H H H H H H H H H H H H
charge: 1
multiplicity: 1
keywords: wb97x-d3
keywords: def2-TZVPP
keywords: def2/J RIJCOSX
keywords: DEFGRID2
keywords: scfconv7
keywords: smallprint printgap noloewdin
keywords: NOSOSCF
formula: C17H21ClN3O
InChI: InChI=1/C17H21ClN3O/c1-16(2)8-7-14(9-13-3-5-15(18)6-4-13)17(16,22)10-21-12-19-11-20-21/h3-6,9,11-12,20,22H,7-8,10H2,1-2H3
43 atoms
O  1.551385 -0.452892 1.621645
N  0.661284 1.88796 0.360896
N  -0.060664 2.010821 -0.756414
N  -1.379149 2.45509 0.915292
C  3.741456 -0.414149 0.479234
C  2.219407 -0.052545 0.455367
C  4.137497 -0.259539 -0.989108
C  1.742239 -0.666554 -0.856204
C  2.946008 -0.812228 -1.769311
C  2.054854 1.474745 0.403199
C  3.89695 -1.880043 0.899299
C  4.576599 0.450178 1.412948
C  0.533342 -1.031804 -1.305251
C  -0.16761 2.155727 1.35732
C  -1.286775 2.342176 -0.400256
C  -0.850133 -0.975613 -0.813704
C  -3.575255 -0.848143 -0.179212
C  -1.838783 -0.978745 -1.807552
C  -1.28147 -0.922773 0.513778
C  -2.629392 -0.86238 0.831517
C  -3.187083 -0.907297 -1.507709
Cl -5.25855 -0.767834 0.219449
H  5.066693 -0.784568 -1.213834
H  4.305321 0.79278 -1.231166
H  3.095904 -1.86482 -2.019343
H  2.791912 -0.289257 -2.714163
H  2.559863 1.914694 -0.454337
H  2.460615 1.936857 1.301388
H  3.661029 -2.0313 1.954095
H  3.275391 -2.564016 0.316688
H  4.933645 -2.188443 0.758582
H  4.634623 1.489778 1.08764
H  4.189803 0.4333 2.43393
H  5.599554 0.071792 1.448681
H  1.519659 -1.416773 1.651782
H  0.149895 2.145607 2.387399
H  -2.072927 2.506891 -1.118923
H  -1.544257 -1.032637 -2.848427
H  -0.572741 -0.926604 1.324792
H  -2.933206 -0.824853 1.868825
H  -3.920782 -0.904498 -2.302433
H  0.561871 -1.405533 -2.326598
H  0.333269 1.832182 -1.675937
elementType: O N C Cl H
totalener: -1360.05396395 hartree
nucrepener: 2045.43925656 hartree
electener: -3405.49322051 hartree
oneelecener: -5898.38593003 hartree
twoeener: 2492.89270953 hartree
cpcmener: -0.11897348 hartree
kineticenergy: 1355.28549172 hartree
xcener: -109.920524373523 hartree
chargesum: 1.0000000
charge: -0.418423 0.086655 -0.013385 -0.359114 0.241501 0.613575 -0.250709 -0.408787 -0.074434 -0.150960 -0.377143 -0.357430 -0.022509 0.152340 0.182494 -0.032630 0.147320 -0.120985 -0.280799 -0.150305 -0.210859 -0.098069 0.082616 0.088518 0.103904 0.091185 0.168621 0.147629 0.099753 0.114890 0.101579 0.094820 0.103362 0.105540 0.238017 0.192258 0.205247 0.135954 0.182623 0.142362 0.143992 0.107939 0.251848
qa: -0.4184 0.0867 -0.0134 -0.3591 0.2415 0.6136 -0.2507 -0.4088 -0.0744 -0.1510 -0.3771 -0.3574 -0.0225 0.1523 0.1825 -0.0326 0.1473 -0.1210 -0.2808 -0.1503 -0.2109 -0.0981 0.0826 0.0885 0.1039 0.0912 0.1686 0.1476 0.0998 0.1149 0.1016 0.0948 0.1034 0.1055 0.2380 0.1923 0.2052 0.1360 0.1826 0.1424 0.1440 0.1079 0.2518
va: 2.0428 3.3752 3.4859 3.0153 3.7951 3.5966 4.0153 3.9529 3.8538 3.7997 3.9455 3.9002 3.6444 4.0067 3.9374 3.6325 3.7810 3.9381 3.8689 3.9881 4.0246 1.2084 1.0167 1.0090 1.0015 1.0142 0.9906 0.9950 1.0080 0.9925 1.0054 0.9988 1.0110 1.0017 0.9953 0.9895 0.9737 1.0080 1.0171 1.0091 1.0071 1.0101 0.9648
dispersion: -0.027601818 hartree
energy: -1360.081565764264 hartree
dipole: 42.90967 -39.56624 3.34343 -1.92075 4.45860 2.53784 -1.57038 -0.05060 -1.62098
magnitude: 4.49964 au
magnitude: 11.43718 debye
