program: Orca
programVersion: 5.0.2
elementType: O N N N C C C C C C C C C C C C C C C C C Cl H H H H H H H H H H H H H H H H H H H H H
charge: 1
multiplicity: 1
keywords: wb97x-d3
keywords: def2-TZVPP
keywords: def2/J RIJCOSX
keywords: DEFGRID2
keywords: scfconv7
keywords: smallprint printgap noloewdin
keywords: NOSOSCF
formula: C17H21ClN3O
InChI: InChI=1/C17H21ClN3O/c1-16(2)8-7-14(9-13-3-5-15(18)6-4-13)17(16,22)10-21-12-19-11-20-21/h3-6,9,11-12,19,22H,7-8,10H2,1-2H3
43 atoms
O  -1.471559 0.430803 1.571448
N  -0.504937 -1.787691 0.088435
N  -0.062413 -2.214049 -1.108644
N  1.572608 -2.096042 0.322945
C  -3.704185 0.301626 0.500174
C  -2.165503 0.036042 0.416209
C  -4.129655 0.213221 -0.966974
C  -1.763547 0.732788 -0.880686
C  -3.002163 0.897677 -1.737331
C  -1.907196 -1.472665 0.307566
C  -3.936595 1.7254 1.016361
C  -4.463924 -0.670587 1.392452
C  -0.56968 1.136092 -1.324995
C  0.478067 -1.699542 0.957109
C  1.210069 -2.390387 -0.94825
C  0.791297 1.065361 -0.763103
C  3.446518 0.915528 0.092712
C  1.169701 1.540746 0.493355
C  1.796672 0.56119 -1.594766
C  3.114361 0.47349 -1.177399
C  2.484378 1.461184 0.926986
Cl 5.089366 0.810771 0.63379
H  -5.100119 0.68167 -1.135168
H  -4.227716 -0.831281 -1.273292
H  -3.216114 1.960227 -1.874212
H  -2.861874 0.478627 -2.73451
H  -2.454222 -1.920837 -0.516949
H  -2.209567 -1.973228 1.226951
H  -3.365839 2.480352 0.470466
H  -4.991561 1.982472 0.912166
H  -3.689457 1.821966 2.075143
H  -4.055665 -0.695145 2.40485
H  -5.507019 -0.360082 1.472402
H  -4.464966 -1.688797 1.001324
H  -1.529607 1.387832 1.664196
H  0.414523 -1.410318 1.991872
H  1.894344 -2.734323 -1.704761
H  0.449735 2.019174 1.138912
H  1.543389 0.221303 -2.591551
H  3.866946 0.06474 -1.838034
H  2.752097 1.838477 1.904648
H  -0.577793 1.539792 -2.335692
H  2.508865 -2.111126 0.712003
elementType: O N C Cl H
totalener: -1360.06606610 hartree
nucrepener: 2062.33891384 hartree
electener: -3422.40497994 hartree
oneelecener: -5933.05500731 hartree
twoeener: 2510.65002737 hartree
cpcmener: -0.10932663 hartree
kineticenergy: 1355.29629258 hartree
xcener: -109.919987275936 hartree
chargesum: 1.0000000
charge: -0.429974 0.131719 -0.287494 -0.088817 0.246508 0.591861 -0.237848 -0.352167 -0.081375 -0.162532 -0.385471 -0.351870 -0.062308 0.172372 0.132336 -0.003915 0.106151 -0.201050 -0.215384 -0.168808 -0.135179 -0.100389 0.082605 0.086720 0.102235 0.090087 0.142004 0.155373 0.115870 0.101986 0.099957 0.101661 0.104961 0.094408 0.235867 0.208301 0.202238 0.151560 0.148711 0.142729 0.142337 0.122885 0.251138
qa: -0.4300 0.1317 -0.2875 -0.0888 0.2465 0.5919 -0.2378 -0.3522 -0.0814 -0.1625 -0.3855 -0.3519 -0.0623 0.1724 0.1323 -0.0039 0.1062 -0.2010 -0.2154 -0.1688 -0.1352 -0.1004 0.0826 0.0867 0.1022 0.0901 0.1420 0.1554 0.1159 0.1020 0.1000 0.1017 0.1050 0.0944 0.2359 0.2083 0.2022 0.1516 0.1487 0.1427 0.1423 0.1229 0.2511
va: 2.0218 3.4558 2.8848 3.5494 3.7762 3.6081 4.0004 3.9638 3.8655 3.8594 3.9482 3.8997 3.7277 3.9204 3.9663 3.5528 3.7818 3.9189 3.8975 3.9808 3.9801 1.2037 1.0157 1.0104 1.0009 1.0137 1.0082 0.9916 0.9925 1.0055 1.0075 1.0110 1.0018 0.9994 1.0076 0.9899 0.9807 1.0076 1.0062 1.0088 1.0078 1.0017 0.9619
dispersion: -0.028288004 hartree
energy: -1360.094354106529 hartree
dipole: -39.62742 39.39583 -0.23159 0.83274 -3.48910 -2.65635 0.11984 0.57244 0.69228
magnitude: 2.75483 au
magnitude: 7.00223 debye
