program: Orca
programVersion: 5.0.2
elementType: O N N N C C C C C C C C C C C C C C C C C Cl H H H H H H H H H H H H H H H H H H H H H
charge: 1
multiplicity: 1
keywords: wb97x-d3
keywords: def2-TZVPP
keywords: def2/J RIJCOSX
keywords: DEFGRID2
keywords: scfconv7
keywords: smallprint printgap noloewdin
keywords: NOSOSCF
formula: C17H21ClN3O
InChI: InChI=1/C17H21ClN3O/c1-16(2)8-7-14(9-13-3-5-15(18)6-4-13)17(16,22)10-21-12-19-11-20-21/h3-6,9,11-12,19,22H,7-8,10H2,1-2H3
43 atoms
O  -1.593863 0.128472 1.658846
N  -0.538838 -1.804956 -0.122485
N  0.208755 -2.166313 0.935994
N  1.426296 -2.032054 -0.863046
C  -3.765265 0.199914 0.483698
C  -2.221667 -0.04752 0.416954
C  -4.130498 0.38155 -0.98962
C  -1.772089 0.878569 -0.710171
C  -2.981909 1.206041 -1.565317
C  -1.951916 -1.510603 0.020702
C  -4.028766 1.506674 1.240849
C  -4.550734 -0.917076 1.15684
C  -0.570019 1.3584 -1.057335
C  0.188699 -1.7110 -1.212547
C  1.408236 -2.290914 0.46667
C  0.807027 1.1907 -0.567536
C  3.505243 0.825594 0.079079
C  1.810176 1.245373 -1.545275
C  1.211329 0.991578 0.753718
C  2.547414 0.809266 1.078088
C  3.145352 1.054287 -1.240025
Cl 5.169786 0.572003 0.482042
H  -5.100161 0.8656 -1.111495
H  -4.198092 -0.588373 -1.488467
H  -3.202461 2.274227 -1.501442
H  -2.79892 0.990575 -2.618759
H  -2.430687 -1.759256 -0.923795
H  -2.328788 -2.193319 0.779694
H  -3.435617 2.346951 0.872164
H  -5.078378 1.783135 1.133025
H  -3.836495 1.406937 2.310604
H  -5.596497 -0.622341 1.259988
H  -4.538025 -1.846491 0.586166
H  -4.174141 -1.127526 2.15995
H  -1.678968 1.051844 1.9227
H  -0.155743 -1.456995 -2.201554
H  2.276145 -2.576762 1.036306
H  1.534951 1.425329 -2.577316
H  0.49065 0.980927 1.55368
H  2.831836 0.65422 2.110093
H  3.891836 1.086178 -2.022103
H  -0.591832 1.952804 -1.968528
H  2.235936 -2.028421 -1.473185
elementType: O N C Cl H
totalener: -1360.06443897 hartree
nucrepener: 2058.84472294 hartree
electener: -3418.90916191 hartree
oneelecener: -5926.05980650 hartree
twoeener: 2507.15064459 hartree
cpcmener: -0.11682311 hartree
kineticenergy: 1355.30303835 hartree
xcener: -109.922746344337 hartree
chargesum: 1.0000000
charge: -0.415309 0.138779 -0.287761 -0.089135 0.231532 0.574676 -0.241804 -0.350903 -0.076121 -0.158503 -0.385174 -0.351139 -0.069731 0.157006 0.135843 0.008887 0.153856 -0.131701 -0.259179 -0.158003 -0.219259 -0.098086 0.082444 0.086530 0.103196 0.089216 0.158946 0.139321 0.116130 0.101667 0.100415 0.105083 0.094383 0.101545 0.237621 0.225387 0.198298 0.135090 0.169513 0.142655 0.142552 0.110590 0.250648
qa: -0.4153 0.1388 -0.2878 -0.0891 0.2315 0.5747 -0.2418 -0.3509 -0.0761 -0.1585 -0.3852 -0.3511 -0.0697 0.1570 0.1358 0.0089 0.1539 -0.1317 -0.2592 -0.1580 -0.2193 -0.0981 0.0824 0.0865 0.1032 0.0892 0.1589 0.1393 0.1161 0.1017 0.1004 0.1051 0.0944 0.1015 0.2376 0.2254 0.1983 0.1351 0.1695 0.1427 0.1426 0.1106 0.2506
va: 2.0416 3.4592 2.8942 3.5450 3.7997 3.6766 4.0022 3.9512 3.8570 3.8336 3.9479 3.8961 3.7124 3.9375 3.9610 3.5837 3.7604 3.9195 3.8739 3.9706 4.0115 1.2079 1.0166 1.0105 1.0008 1.0140 0.9918 1.0107 0.9920 1.0057 1.0073 1.0016 0.9991 1.0116 0.9952 0.9661 0.9812 1.0086 1.0223 1.0099 1.0083 1.0086 0.9635
dispersion: -0.028087454 hartree
energy: -1360.092526427675 hartree
dipole: -40.65901 39.94816 -0.71085 1.48575 -3.92555 -2.43980 -2.79130 -0.05017 -2.84147
magnitude: 3.81207 au
magnitude: 9.68952 debye
