program: Orca
programVersion: 5.0.2
elementType: Cl O N N N C C C C C C C C C C C C C C C C C H H H H H H H H H H H H H H H H H H H H H
charge: 1
multiplicity: 1
keywords: wb97x-d3
keywords: def2-TZVPP
keywords: def2/J RIJCOSX
keywords: DEFGRID2
keywords: scfconv7
keywords: smallprint printgap noloewdin
keywords: NOSOSCF
formula: C17H21ClN3O
InChI: InChI=1/C17H21ClN3O/c1-16(2)8-7-14(9-13-3-5-15(18)6-4-13)17(16,22)10-21-12-19-11-20-21/h3-6,9,11-12,19,22H,7-8,10H2,1-2H3
43 atoms
Cl -5.952192 -0.530092 0.002469
O  2.664589 -0.226642 1.625702
N  2.304658 1.927175 -0.146705
N  1.445332 2.441459 -1.037126
N  1.348004 3.531848 0.842581
C  2.994702 -1.822946 -0.27245
C  2.411751 -0.487799 0.272071
C  2.238775 -1.97538 -1.602055
C  0.946427 -0.586415 -0.097948
C  0.84764 -1.343574 -1.393028
C  3.046676 0.711101 -0.452862
C  2.603559 -2.958247 0.678606
C  4.508372 -1.818442 -0.445209
C  -0.031967 -0.150969 0.700046
C  -1.476062 -0.229195 0.483179
C  2.252162 2.565753 0.998336
C  -2.319019 -0.297673 1.595233
C  -2.064815 -0.225947 -0.782648
C  0.86742 3.421847 -0.42618
C  -3.690761 -0.396416 1.45798
C  -3.43735 -0.314672 -0.935059
C  -4.247435 -0.409314 0.186863
H  2.173502 -3.020787 -1.903017
H  2.775258 -1.467863 -2.407722
H  0.053105 -2.090791 -1.338308
H  0.591949 -0.691034 -2.231356
H  3.020018 0.60808 -1.534519
H  4.081457 0.852643 -0.140948
H  1.529546 -3.001256 0.872487
H  2.885811 -3.915601 0.24083
H  3.126652 -2.893724 1.635119
H  5.019684 -1.595624 0.492948
H  4.852195 -2.799766 -0.773013
H  4.849443 -1.105845 -1.198681
H  2.239095 -0.904759 2.161314
H  0.254316 0.277832 1.658267
H  2.828255 2.351921 1.882749
H  -1.893254 -0.292847 2.591541
H  -1.454492 -0.128686 -1.669193
H  0.114763 4.064353 -0.851787
H  -4.325721 -0.465361 2.330219
H  -3.877481 -0.307415 -1.922564
H  1.080448 4.212851 1.539111
totalener: -1359.98142500 hartree
nucrepener: 1974.98608417 hartree
electener: -3334.96750917 hartree
oneelecener: -5760.33594232 hartree
twoeener: 2425.36843315 hartree
kineticenergy: 1355.34214342 hartree
xcener: -109.924877160929 hartree
chargesum: 1.0000000
charge: -0.037425 -0.377700 0.132674 -0.224881 -0.111862 0.204422 0.597261 -0.268919 -0.325442 -0.153326 -0.258330 -0.365991 -0.317683 -0.072255 0.069684 0.138758 -0.165030 -0.235653 0.146475 -0.144175 -0.127495 0.089673 0.096736 0.092593 0.137529 0.101876 0.155568 0.159428 0.126127 0.107690 0.097004 0.111636 0.115569 0.081492 0.206708 0.089094 0.212716 0.113085 0.141626 0.189810 0.132297 0.131363 0.207274
qa: -0.0374 -0.3777 0.1327 -0.2249 -0.1119 0.2044 0.5973 -0.2689 -0.3254 -0.1533 -0.2583 -0.3660 -0.3177 -0.0723 0.0697 0.1388 -0.1650 -0.2357 0.1465 -0.1442 -0.1275 0.0897 0.0967 0.0926 0.1375 0.1019 0.1556 0.1594 0.1261 0.1077 0.0970 0.1116 0.1156 0.0815 0.2067 0.0891 0.2127 0.1131 0.1416 0.1898 0.1323 0.1314 0.2073
va: 1.2713 2.0751 3.4787 2.8904 3.5506 3.7606 3.5523 4.0201 3.5309 3.8746 3.8957 3.9365 3.9003 3.7276 3.6406 3.9480 4.0215 4.0064 3.9225 4.0283 4.0270 3.9976 1.0214 1.0131 0.9967 1.0142 0.9995 0.9932 0.9899 1.0109 1.0061 1.0085 1.0074 1.0014 1.0391 1.0405 0.9888 1.0142 0.9984 0.9817 1.0116 1.0130 0.9928
dispersion: -0.024348964 hartree
energy: -1360.005773966554 hartree
dipole: 36.20950 -32.82342 3.38609 -10.79738 14.13777 3.34038 -1.68500 2.63878 0.95377
magnitude: 4.85113 au
magnitude: 12.33058 debye
