program: Orca
programVersion: 5.0.2
elementType: Cl O N N N C C C C C C C C C C C C C C C C C H H H H H H H H H H H H H H H H H H H H H
charge: 1
multiplicity: 1
keywords: wb97x-d3
keywords: def2-TZVPP
keywords: def2/J RIJCOSX
keywords: DEFGRID2
keywords: scfconv7
keywords: smallprint printgap noloewdin
keywords: NOSOSCF
formula: C17H21ClN3O
InChI: InChI=1/C17H21ClN3O/c1-16(2)8-7-14(9-13-3-5-15(18)6-4-13)17(16,22)10-21-12-19-11-20-21/h3-6,9,11-12,19,22H,7-8,10H2,1-2H3
43 atoms
Cl -5.912181 -0.667934 -0.369816
O  2.711484 -0.051958 1.598569
N  2.291667 1.924605 -0.323061
N  1.27225 2.383774 -1.066891
N  1.699748 3.739658 0.577653
C  2.948696 -1.847011 -0.122145
C  2.371142 -0.4634 0.304107
C  2.08162 -2.188348 -1.342606
C  0.883523 -0.638815 0.068252
C  0.67467 -1.671441 -1.008069
C  2.922466 0.647391 -0.607405
C  2.691813 -2.861143 0.995933
C  4.437802 -1.833242 -0.440605
C  -0.060517 0.006978 0.744213
C  -1.505843 -0.167914 0.477164
C  2.557636 2.73306 0.677667
C  -2.227147 -1.209757 1.054594
C  -2.174852 0.715182 -0.367568
C  0.923248 3.496736 -0.506411
C  -3.581153 -1.371259 0.798443
C  -3.527674 0.569286 -0.633079
C  -4.220522 -0.476911 -0.044902
H  2.092951 -3.257768 -1.556878
H  2.469884 -1.689828 -2.234119
H  0.030804 -2.473093 -0.640137
H  0.169936 -1.252816 -1.8815
H  2.753871 0.441928 -1.661614
H  3.993246 0.774045 -0.451377
H  1.645925 -2.899357 1.310828
H  2.959027 -3.861672 0.652144
H  3.29786 -2.655889 1.88049
H  5.026257 -1.454251 0.398031
H  4.787719 -2.846443 -0.64728
H  4.676719 -1.232598 -1.319881
H  2.215332 -0.570256 2.243218
H  0.211768 0.720052 1.518842
H  3.332299 2.615359 1.416531
H  -1.729952 -1.908446 1.716007
H  -1.63261 1.527543 -0.834969
H  0.131517 4.146771 -0.838959
H  -4.126823 -2.187047 1.253573
H  -4.029937 1.26327 -1.293789
H  1.650675 4.544441 1.192356
elementType: Cl O N C H
totalener: -1360.07730591 hartree
nucrepener: 1971.91251063 hartree
electener: -3331.98981655 hartree
oneelecener: -5754.15697040 hartree
twoeener: 2422.16715385 hartree
cpcmener: -0.10391236 hartree
kineticenergy: 1355.29494689 hartree
xcener: -109.913568589430 hartree
chargesum: 1.0000000
charge: -0.097128 -0.420832 0.128395 -0.297433 -0.093339 0.252157 0.542209 -0.244695 -0.387380 -0.089742 -0.178902 -0.366062 -0.351399 0.004194 0.030053 0.183750 -0.221015 -0.211946 0.155383 -0.148470 -0.164845 0.100520 0.084687 0.089322 0.105253 0.092307 0.146513 0.153198 0.110192 0.101171 0.099036 0.103564 0.106412 0.092120 0.235053 0.128655 0.211388 0.144642 0.145277 0.200527 0.143894 0.140819 0.242500
qa: -0.0971 -0.4208 0.1284 -0.2974 -0.0933 0.2522 0.5422 -0.2447 -0.3874 -0.0897 -0.1789 -0.3661 -0.3514 0.0042 0.0301 0.1837 -0.2210 -0.2119 0.1554 -0.1485 -0.1648 0.1005 0.0847 0.0893 0.1053 0.0923 0.1465 0.1532 0.1102 0.1012 0.0990 0.1036 0.1064 0.0921 0.2351 0.1287 0.2114 0.1446 0.1453 0.2005 0.1439 0.1408 0.2425
va: 1.2073 2.0409 3.4667 2.8760 3.5625 3.7452 3.6943 4.0167 3.8146 3.8784 3.8658 3.9438 3.9034 3.7012 3.6279 3.9232 3.9762 3.9689 3.9150 3.9836 4.0319 3.8296 1.0159 1.0098 1.0022 1.0132 1.0034 0.9926 0.9954 1.0054 1.0090 1.0085 1.0028 1.0000 1.0073 1.0129 0.9822 1.0057 1.0037 0.9777 1.0054 1.0083 0.9684
dispersion: -0.024858404 hartree
energy: -1360.102164315518 hartree
dipole: 36.07693 -31.25955 4.81738 -10.38891 15.08106 4.69215 0.61484 0.53194 1.14678
magnitude: 6.82191 au
magnitude: 17.33992 debye
