program: Gaussian 09
title: 000070993
version: EM64L-G09RevD.01
frameworkgroup: C1[X(C12H16O)]
method: RPBEPBE
basis: SDD
operation: Freq
keyword: #pfreq=noraman
keyword: PBEPBE/SDD
title: #p freq=noraman PBEPBE/SDD
converged: YES YES NO NO
title: Mulliken charges:
elementType: O C C C C C C C C C C C C H H H H H H H H H H H H H H H H
charge: -0.229583 -0.253255 0.585556 -0.529777 0.174977 -0.689823 -0.691941 -0.474034 0.345243 -0.413601 0.089491 -0.781066 -0.799747 0.210459 0.242333 0.209407 0.214795 0.228379 0.228711 0.215207 0.207882 0.237376 0.232791 0.248227 0.205930 0.248420 0.237943 0.237766 0.261936
chargesum: 0.00000
title: Mulliken charges with hydrogens summed into heavy atoms:
elementType: O C C C C C C C C C C C C
charge: -0.229583 -0.042796 0.585556 -0.287444 0.174977 -0.037243 -0.040142 -0.236657 0.345243 -0.180810 0.089491 -0.078490 -0.062102
polarizability: 1.75127607e+02 -4.27423323e-01 1.44013523e+02 -2.11093723e-01 1.49669248e-01 8.25945777e+01
1716.lowfreq: -7.7823 -0.0008 -0.0007 -0.0003 8.3048 11.9609 25.1705 36.6173 92.2948
frequency: 24.3353 36.4834 92.2833 125.2990 134.5579 192.6902 205.5435 210.8641 228.2185 236.4451 263.1441 285.5725 344.9251 382.2630 386.9156 422.6904 428.2427 470.3650 524.6880 531.8690 603.7013 648.9654 678.4195 732.8648 734.3063 842.5393 848.0701 904.6520 908.1473 916.2986 943.3051 953.6600 968.9754 1002.9409 1019.5202 1044.4791 1060.5200 1074.4565 1113.0282 1137.1915 1164.9529 1205.1319 1217.9007 1259.9340 1282.3660 1309.6621 1326.2479 1365.6311 1375.1174 1375.9133 1394.5020 1404.2429 1408.3020 1450.8218 1451.9668 1461.9262 1465.6931 1467.2599 1467.7660 1478.2746 1481.4138 1491.7820 1561.8173 1591.2113 1618.9431 2973.8959 2977.2944 2981.4147 2985.8328 2987.9038 3066.4453 3072.2313 3074.0115 3076.7892 3078.1498 3082.1835 3085.6188 3113.0663 3123.3847 3137.2597 3145.0214
redmass: 2.7718 4.1691 3.0213 3.5870 3.2293 1.0432 1.1833 1.0501 2.3549 1.2840 2.3196 2.9563 3.0590 5.4678 3.3275 3.1316 2.8603 3.2963 2.9649 2.7950 3.9933 2.9734 4.7734 3.9186 2.5772 1.3515 3.7988 2.7776 1.5492 1.1812 2.1199 1.4502 1.3762 1.4746 1.7750 1.6295 2.2614 1.6679 2.5487 1.8767 1.4348 2.8331 1.9850 2.5990 1.3913 1.3275 2.4685 1.2861 2.2709 1.5174 1.2462 1.5694 1.5768 1.0465 1.1064 1.1575 1.0508 1.0460 1.0497 1.1073 1.4572 1.5511 5.6912 6.9481 6.2416 1.0350 1.0353 1.0842 1.0372 1.0367 1.0998 1.0973 1.0990 1.0956 1.1005 1.0998 1.1011 1.0874 1.0992 1.0958 1.0902
irintensity: 0.5792 4.1815 0.8789 0.0098 0.4157 0.8959 0.5302 0.6635 0.1053 1.2081 3.1423 1.0120 0.6318 0.9710 0.7273 0.4038 0.3004 1.0712 1.4295 11.8266 20.4786 4.6167 0.5156 1.8512 3.2754 24.3302 3.6762 5.0944 10.4079 2.3463 24.2894 0.0757 0.1492 1.8084 0.1782 11.5801 20.3563 11.0825 1.3694 5.5536 1.8726 38.8039 5.2366 146.3100 4.5200 0.9110 16.1287 47.6471 13.1604 14.4791 8.5422 12.1765 10.0992 11.4060 28.8395 14.2395 17.9824 0.5202 7.5862 32.1219 20.8106 18.7173 96.9740 83.4871 8.4434 30.2219 31.5818 17.5502 4.5541 25.0887 3.4174 12.3495 102.4591 9.6221 25.1937 39.6599 27.5406 13.1189 17.2644 35.1029 5.6522
temp: 298.150 k
press: 1.00000 atm
elementType: 8 6 6 6 6 6 6 6 6 6 6 6 6 1 1 1 1 1 1 1 1 1 1 1 1 1 1 1 1
symmnumber: 1
zpe: 644205.3 jmol-1
zpe.correction: 0.245365 hartree
zpe.thermalcorrener: 0.259342 hartree
zpe.thermalcorrenthalpy: 0.260286 hartree
zpe.thermalcorrgfe: 0.204226 hartree
zpe.sumelectzpe: -541.131263 hartree
zpe.sumelectthermal: -541.117286 hartree
zpe.sumelectthermalent: -541.116341 hartree
zpe.sumelectthermalfe: -541.172402 hartree
dipole: 3.5711 -0.2437 -0.0211
dipole: 3.5795
quadrupole: -86.4857 -71.1746 -81.0293
quadrupole: 3.1380 0.0663 0.0197
quadrupole: -6.9225 8.3886 -1.4661 3.1380 0.0663 0.0197
hfenergy: -541.3766275 hartree
pointgroup: C01 [X(C12H16O1)]
dipole: -1.4074334 0.0144559 0.0464469 debye
polarizability: 174.9553194|1.439451|144.0149153|-3.2974471|1.7696776|82.7654723 unknown
InChI: InChI=1S/C12H16O/c1-8(2)11-6-5-9(3)12(7-11)10(4)13/h5-8H,1-4H3
charge 0 multiplicity 1
29 atoms
O  3.318071 -0.912581 -0.216664
C  -2.874016 -0.066753 0.018339
C  -1.413695 0.392204 -0.025464
C  -0.348961 -0.534145 -0.086389
C  1.017827 -0.137597 -0.121455
C  -3.179766 -0.86929 1.311828
C  -3.259597 -0.886498 -1.241896
C  -1.077448 1.767495 0.000312
C  1.345962 1.263748 -0.09401
C  0.270328 2.184214 -0.033399
C  2.081682 -1.197293 -0.18739
C  2.761859 1.806501 -0.126544
C  1.663123 -2.670951 -0.221128
H  -3.507063 0.843512 0.032024
H  -0.587711 -1.602465 -0.108401
H  -2.58262 -1.7996 1.351178
H  -4.248048 -1.152515 1.350451
H  -2.943934 -0.278395 2.215033
H  -3.073917 -0.311246 -2.166636
H  -4.330118 -1.162171 -1.213068
H  -2.673531 -1.82269 -1.302156
H  -1.876445 2.518232 0.047103
H  0.500497 3.256011 -0.012716
H  3.304174 1.475952 -1.029365
H  2.746158 2.910507 -0.097648
H  3.361246 1.430687 0.720675
H  1.031811 -2.89147 -1.10182
H  1.08893 -2.95035 0.681541
H  2.574203 -3.286254 -0.270331
