program: Orca
programVersion: 5.0.2
elementType: Cl Cl O O N N N C C C C C C C C C C C C H H H H H H H H H H H H
charge: 1
multiplicity: 1
keywords: wb97x-d3
keywords: def2-TZVPP
keywords: def2/J RIJCOSX
keywords: DEFGRID2
keywords: scfconv7
keywords: smallprint printgap noloewdin
keywords: NOSOSCF
formula: C12H12Cl2N3O2
InChI: InChI=1/C12H12Cl2N3O2/c13-9-1-2-10(11(14)5-9)12(18-3-4-19-12)6-17-8-15-7-16-17/h1-2,5,7-8,16H,3-4,6H2
31 atoms
Cl -0.754361 0.481245 2.390185
Cl -5.273575 0.44072 -0.435787
O  1.144571 -1.120124 0.775264
O  1.147231 -0.963078 -1.44046
N  2.864908 0.860794 -0.221911
N  3.572407 0.462997 0.839745
N  4.94793 0.626475 -0.834343
C  0.7203 -0.319614 -0.280243
C  1.426181 1.035699 -0.20888
C  -0.793699 -0.120662 -0.281474
C  0.999606 -2.462083 0.333324
C  1.244374 -2.360949 -1.172191
C  -1.520526 0.227802 0.856602
C  -1.501463 -0.274444 -1.469249
C  -2.895408 0.403353 0.818432
C  -2.873864 -0.108595 -1.534896
C  3.725751 0.946332 -1.223963
C  -3.561094 0.227938 -0.382317
C  4.826901 0.335622 0.450113
H  1.151527 1.600361 0.680707
H  1.172379 1.636936 -1.08036
H  -0.000589 -2.840563 0.562362
H  1.73277 -3.078211 0.851304
H  2.240092 -2.699223 -1.462135
H  0.5033 -2.917926 -1.747861
H  -0.97346 -0.531256 -2.376749
H  -3.4354 0.672056 1.716075
H  -3.391688 -0.241877 -2.474577
H  3.422559 1.250384 -2.213749
H  5.615311 0.032011 1.120493
H  3.145325 0.321077 1.751377
elementType: Cl O N C H
totalener: -1699.52434328 hartree
nucrepener: 1743.71773805 hartree
electener: -3443.24208133 hartree
oneelecener: -5775.97129694 hartree
twoeener: 2332.72921561 hartree
cpcmener: -0.10014857 hartree
kineticenergy: 1694.91564992 hartree
xcener: -116.366393533923 hartree
chargesum: 1.0000000
charge: -0.069655 -0.072463 -0.373055 -0.391194 0.098418 -0.031520 -0.358832 0.581338 -0.082765 -0.124380 0.024112 0.002776 -0.020387 -0.125880 -0.149783 -0.188284 0.162507 0.118709 0.194275 0.168336 0.144536 0.100023 0.112584 0.104548 0.103255 0.152133 0.124978 0.146382 0.195885 0.205426 0.247979
qa: -0.0697 -0.0725 -0.3731 -0.3912 0.0984 -0.0315 -0.3588 0.5813 -0.0828 -0.1244 0.0241 0.0028 -0.0204 -0.1259 -0.1498 -0.1883 0.1625 0.1187 0.1943 0.1683 0.1445 0.1000 0.1126 0.1045 0.1033 0.1521 0.1250 0.1464 0.1959 0.2054 0.2480
va: 1.2508 1.2308 1.9783 1.9750 3.3948 3.5117 3.0445 3.8969 3.7250 3.5487 3.9036 3.9175 4.0114 3.9528 4.0744 4.0558 4.0034 3.8760 3.9450 1.0080 1.0076 1.0013 0.9987 0.9998 0.9989 1.0204 1.0242 1.0072 0.9822 0.9721 0.9753
dispersion: -0.016956559 hartree
energy: -1699.541299835289 hartree
dipole: 18.92815 -14.03458 4.89357 -7.35200 7.48189 0.12989 -7.06772 7.31669 0.24897
magnitude: 4.90162 au
magnitude: 12.45893 debye
