program: Orca
programVersion: 5.0.2
elementType: Cl Cl O O N N N C C C C C C C C C C C C H H H H H H H H H H H H
charge: 1
multiplicity: 1
keywords: wb97x-d3
keywords: def2-TZVPP
keywords: def2/J RIJCOSX
keywords: DEFGRID2
keywords: scfconv7
keywords: smallprint printgap noloewdin
keywords: NOSOSCF
formula: C12H12Cl2N3O2
InChI: InChI=1/C12H12Cl2N3O2/c13-9-1-2-10(11(14)5-9)12(18-3-4-19-12)6-17-8-15-7-16-17/h1-2,5,7-8,15H,3-4,6H2
31 atoms
Cl -0.095464 0.200041 2.859618
Cl -4.370323 -0.778431 -0.157699
O  1.729052 1.731191 -0.980663
O  1.62279 1.945223 1.251764
N  2.022209 -1.173241 -0.623581
N  2.449202 -1.072124 -1.895874
N  1.123491 -2.783332 -1.652029
C  1.380814 1.060593 0.191765
C  2.314613 -0.148513 0.356746
C  -0.083189 0.621588 0.152768
C  1.517982 3.114548 -0.728347
C  1.939759 3.22998 0.720928
C  -0.803142 0.225558 1.27901
C  -0.730336 0.534969 -1.077616
C  -2.120741 -0.199397 1.192591
C  -2.040947 0.10528 -1.194334
C  1.210541 -2.195781 -0.46826
C  -2.729521 -0.250291 -0.048433
C  1.892915 -2.066954 -2.507893
H  2.19554 -0.594745 1.341694
H  3.353109 0.156689 0.240782
H  0.467853 3.38834 -0.874862
H  2.135155 3.694252 -1.412114
H  3.011639 3.421776 0.821639
H  1.389605 3.997044 1.26624
H  -0.202778 0.811563 -1.979745
H  -2.659172 -0.490272 2.084084
H  -2.509611 0.052078 -2.166921
H  0.725512 -2.50459 0.444301
H  2.017691 -2.311139 -3.549083
H  0.576888 -3.610629 -1.865789
elementType: Cl O N C H
totalener: -1699.53050049 hartree
nucrepener: 1784.63946462 hartree
electener: -3484.16996511 hartree
oneelecener: -5858.56222106 hartree
twoeener: 2374.39225595 hartree
cpcmener: -0.11769141 hartree
kineticenergy: 1694.91146092 hartree
xcener: -116.362823454853 hartree
chargesum: 1.0000000
charge: -0.067782 -0.079171 -0.387841 -0.387101 0.121626 -0.289246 -0.078828 0.611106 -0.113715 -0.108674 -0.011600 0.048739 -0.051896 -0.133686 -0.120074 -0.171542 0.183574 0.108043 0.155957 0.148515 0.138331 0.098008 0.116699 0.088400 0.094642 0.149826 0.122206 0.148065 0.218519 0.199369 0.249532
qa: -0.0678 -0.0792 -0.3878 -0.3871 0.1216 -0.2892 -0.0788 0.6111 -0.1137 -0.1087 -0.0116 0.0487 -0.0519 -0.1337 -0.1201 -0.1715 0.1836 0.1080 0.1560 0.1485 0.1383 0.0980 0.1167 0.0884 0.0946 0.1498 0.1222 0.1481 0.2185 0.1994 0.2495
va: 1.2509 1.2238 1.9857 1.9904 3.4485 2.9128 3.5594 3.8218 3.8590 3.5848 3.9642 3.9394 4.0408 3.8599 4.0636 4.0580 3.9198 3.8725 3.9464 1.0109 1.0232 0.9948 0.9970 0.9966 0.9960 1.0246 1.0241 1.0047 0.9688 0.9788 0.9636
dispersion: -0.018004727 hartree
energy: -1699.548505217435 hartree
dipole: 15.77609 -13.51733 2.25876 5.80183 -9.31767 -3.51583 -9.24386 6.77714 -2.46672
magnitude: 4.85261 au
magnitude: 12.33434 debye
