program: Orca
programVersion: 5.0.2
elementType: Cl Cl O O O N N N C C C C C C C C C C C C C C C C C C C H H H H H H H H H H H H H H H H H H
charge: 1
multiplicity: 1
keywords: wb97x-d3
keywords: def2-TZVPP
keywords: def2/J RIJCOSX
keywords: DEFGRID2
keywords: scfconv7
keywords: smallprint printgap noloewdin
keywords: NOSOSCF
formula: C19H18Cl2N3O3
InChI: InChI=1/C19H18Cl2N3O3/c1-13-9-25-19(27-13,10-24-12-22-11-23-24)17-7-6-16(8-18(17)21)26-15-4-2-14(20)3-5-15/h2-8,11-13,23H,9-10H2,1H3
45 atoms
Cl 0.72781 -1.825645 -0.149336
Cl -7.266501 -2.2234 -0.798288
O  2.901599 -0.027164 -1.016311
O  3.196387 1.931918 -0.022713
O  -3.012879 1.450493 0.83241
N  4.603772 -0.156366 1.182876
N  5.130491 -1.00907 0.297542
N  6.783243 0.0147 1.274714
C  2.558361 0.707604 0.124511
C  3.048055 0.891558 -2.107229
C  3.170009 0.020755 1.348973
C  3.116311 2.25848 -1.401023
C  1.058726 0.847374 0.31165
C  1.91808 0.771761 -3.103896
C  0.169766 -0.218549 0.18822
C  0.516976 2.08793 0.648455
C  -1.196604 -0.061508 0.350712
C  -0.838874 2.274363 0.809566
C  -1.707364 1.197457 0.650088
C  5.632407 0.451395 1.756495
C  6.450011 -0.881882 0.369113
C  -3.970118 0.544873 0.434618
C  -4.790026 -0.012578 1.399638
C  -4.15406 0.255414 -0.908717
C  -5.811017 -0.868721 1.01806
C  -5.168017 -0.607543 -1.288577
C  -5.994755 -1.164686 -0.32345
H  3.998268 0.655029 -2.594318
H  2.711165 -0.950495 1.533312
H  3.024937 0.637306 2.234385
H  3.99731 2.840867 -1.667606
H  2.225624 2.859261 -1.611092
H  2.07776 1.466777 -3.929236
H  0.95618 1.005619 -2.64749
H  1.864671 -0.231188 -3.524201
H  1.173692 2.937293 0.779273
H  -1.848083 -0.918662 0.248522
H  -1.236107 3.248967 1.058128
H  5.509398 1.19888 2.524864
H  7.130335 -1.452115 -0.244639
H  -4.645197 0.232363 2.443279
H  -3.52305 0.709917 -1.661743
H  -6.462796 -1.300998 1.764068
H  -5.324203 -0.834373 -2.333762
H  4.53262 -1.496737 -0.36113
totalener: -2045.04142181 hartree
nucrepener: 2750.49259391 hartree
electener: -4795.53401572 hartree
oneelecener: -8247.39157386 hartree
twoeener: 3451.85755814 hartree
kineticenergy: 2039.07405045 hartree
xcener: -150.081429937981 hartree
chargesum: 1.0000000
charge: -0.054270 -0.046313 -0.395164 -0.346743 -0.275280 0.095892 -0.047757 -0.276903 0.610381 0.169450 -0.180980 -0.057982 -0.237285 -0.273651 -0.032636 -0.084069 -0.140905 -0.223898 0.264394 0.168540 0.174468 0.223856 -0.187428 -0.181364 -0.091894 -0.099964 0.056051 0.084494 0.182618 0.129864 0.115180 0.110828 0.109106 0.087752 0.099872 0.150978 0.133159 0.143759 0.173127 0.192526 0.135044 0.135445 0.133096 0.131066 0.223540
qa: -0.0543 -0.0463 -0.3952 -0.3467 -0.2753 0.0959 -0.0478 -0.2769 0.6104 0.1695 -0.1810 -0.0580 -0.2373 -0.2737 -0.0326 -0.0841 -0.1409 -0.2239 0.2644 0.1685 0.1745 0.2239 -0.1874 -0.1814 -0.0919 -0.1000 0.0561 0.0845 0.1826 0.1299 0.1152 0.1108 0.1091 0.0878 0.0999 0.1510 0.1332 0.1438 0.1731 0.1925 0.1350 0.1354 0.1331 0.1311 0.2235
va: 1.2769 1.2577 1.9306 2.0088 2.1458 3.3920 3.4794 3.0676 3.8320 3.8201 3.7353 3.9414 3.5289 4.0001 4.0764 3.9149 3.9420 4.0853 3.9006 4.0105 3.9578 3.7859 4.0529 4.0045 3.9637 3.9743 3.9956 1.0026 1.0078 1.0138 1.0039 0.9981 1.0078 0.9982 1.0105 1.0136 1.0235 1.0129 0.9888 0.9773 1.0092 1.0026 1.0079 1.0095 1.0066
dispersion: -0.025491457 hartree
energy: -2045.066913269146 hartree
dipole: 24.31349 -17.95336 6.36013 15.19452 -15.02239 0.17213 -6.10516 6.37504 0.26988
magnitude: 6.36818 au
magnitude: 16.18663 debye
