program: Orca
programVersion: 5.0.2
elementType: Cl Cl O O O N N N C C C C C C C C C C C C C C C C C C C H H H H H H H H H H H H H H H H H H
charge: 1
multiplicity: 1
keywords: wb97x-d3
keywords: def2-TZVPP
keywords: def2/J RIJCOSX
keywords: DEFGRID2
keywords: scfconv7
keywords: smallprint printgap noloewdin
keywords: NOSOSCF
formula: C19H18Cl2N3O3
InChI: InChI=1/C19H18Cl2N3O3/c1-13-9-25-19(27-13,10-24-12-22-11-23-24)17-7-6-16(8-18(17)21)26-15-4-2-14(20)3-5-15/h2-8,11-13,23H,9-10H2,1H3
45 atoms
Cl 2.556693 -1.778826 -0.936791
Cl -7.562148 0.774927 0.895388
O  3.43169 1.010387 -1.203226
O  2.217345 2.714537 -0.469154
O  -2.307984 -1.625701 -0.044375
N  3.821713 0.069743 1.412741
N  4.859787 -0.408595 0.717892
N  4.366227 -1.878337 2.246271
C  2.509796 1.383348 -0.221991
C  3.176267 1.794883 -2.381761
C  3.231405 1.36653 1.13607
C  2.163052 2.837522 -1.880748
C  1.245793 0.529033 -0.202391
C  2.670205 0.946972 -3.525267
C  1.169381 -0.835701 -0.488574
C  0.054072 1.1498 0.172194
C  -0.025243 -1.528497 -0.433302
C  -1.15374 0.482075 0.24243
C  -1.198004 -0.87217 -0.072599
C  3.551689 -0.842829 2.336862
C  5.152281 -1.598134 1.227171
C  -3.530393 -1.029036 0.178985
C  -4.109282 -1.132501 1.431306
C  -4.180695 -0.378766 -0.857098
C  -5.359721 -0.576823 1.652743
C  -5.428083 0.180399 -0.634834
C  -6.011208 0.081296 0.62046
H  4.122572 2.268473 -2.65533
H  2.535003 1.578926 1.945156
H  4.021477 2.119788 1.152847
H  2.426375 3.859956 -2.145922
H  1.155059 2.625349 -2.253328
H  1.722758 0.465572 -3.282601
H  3.388187 0.175918 -3.799569
H  2.512284 1.573338 -4.404147
H  0.063349 2.205481 0.408764
H  -0.057671 -2.582701 -0.673032
H  -2.045173 1.019688 0.53414
H  2.765998 -0.715289 3.065562
H  5.939947 -2.224904 0.838495
H  -3.597397 -1.657666 2.226934
H  -3.72682 -0.31997 -1.837942
H  -5.826137 -0.659266 2.624383
H  -5.948566 0.683767 -1.437507
H  5.114446 0.024447 -0.164847
totalener: -2045.03850323 hartree
nucrepener: 2793.54802400 hartree
electener: -4838.58652722 hartree
oneelecener: -8333.10659704 hartree
twoeener: 3494.52006982 hartree
kineticenergy: 2039.07996567 hartree
xcener: -150.082536543414 hartree
chargesum: 1.0000000
charge: -0.064295 -0.043227 -0.399690 -0.329072 -0.278688 0.055077 -0.051882 -0.261869 0.587491 0.118322 -0.123480 -0.027832 -0.120082 -0.268337 -0.070360 -0.195500 -0.131824 -0.151142 0.226889 0.164412 0.170469 0.205411 -0.165518 -0.162141 -0.107424 -0.110463 0.066771 0.094247 0.131297 0.158790 0.120051 0.101543 0.085831 0.096740 0.112515 0.151024 0.136408 0.147261 0.176659 0.189930 0.131886 0.135108 0.133087 0.133358 0.232251
qa: -0.0643 -0.0432 -0.3997 -0.3291 -0.2787 0.0551 -0.0519 -0.2619 0.5875 0.1183 -0.1235 -0.0278 -0.1201 -0.2683 -0.0704 -0.1955 -0.1318 -0.1511 0.2269 0.1644 0.1705 0.2054 -0.1655 -0.1621 -0.1074 -0.1105 0.0668 0.0942 0.1313 0.1588 0.1201 0.1015 0.0858 0.0967 0.1125 0.1510 0.1364 0.1473 0.1767 0.1899 0.1319 0.1351 0.1331 0.1334 0.2323
va: 1.2602 1.2607 1.9325 2.0306 2.1391 3.4087 3.4621 3.0532 3.8218 3.8802 3.8110 3.9347 3.5192 3.9734 3.9878 4.0406 4.0547 3.9576 3.9674 4.0048 3.9801 3.7958 4.0319 4.0114 3.9750 3.9784 3.9876 1.0038 1.0080 1.0094 0.9994 1.0012 0.9996 1.0101 1.0100 1.0211 1.0204 1.0075 0.9871 0.9796 1.0079 1.0040 1.0085 1.0088 1.0067
dispersion: -0.026629552 hartree
energy: -2045.065132777662 hartree
dipole: 20.48727 -14.94158 5.54569 11.12762 -10.20496 0.92266 -9.26472 9.62653 0.36181
magnitude: 5.63355 au
magnitude: 14.31933 debye
