program: Orca
programVersion: 5.0.2
elementType: Cl Cl O O O N N N C C C C C C C C C C C C C C C C C C C H H H H H H H H H H H H H H H H H H
charge: 1
multiplicity: 1
keywords: wb97x-d3
keywords: def2-TZVPP
keywords: def2/J RIJCOSX
keywords: DEFGRID2
keywords: scfconv7
keywords: smallprint printgap noloewdin
keywords: NOSOSCF
formula: C19H18Cl2N3O3
InChI: InChI=1/C19H18Cl2N3O3/c1-13-9-25-19(27-13,10-24-12-22-11-23-24)17-7-6-16(8-18(17)21)26-15-4-2-14(20)3-5-15/h2-8,11-13,23H,9-10H2,1H3
45 atoms
Cl 1.750046 -1.300509 2.626694
Cl -7.504581 0.408309 -2.273734
O  2.556367 1.137841 -1.06932
O  3.087246 0.824773 1.068626
O  -2.980557 -1.000757 1.160614
N  4.583599 -0.787263 -0.537549
N  5.395849 -0.657987 0.516594
N  6.571073 -0.229495 -1.262562
C  2.42051 0.242919 -0.010819
C  2.808421 2.451117 -0.547797
C  3.160403 -1.043876 -0.401936
C  2.82825 2.21383 0.964248
C  0.971891 -0.081699 0.298359
C  1.774883 3.453641 -1.002993
C  0.585136 -0.762158 1.456745
C  -0.036099 0.265936 -0.593604
C  -0.734965 -1.056295 1.723111
C  -1.369806 -0.015959 -0.353427
C  -1.723917 -0.676645 0.817692
C  5.324698 -0.511809 -1.601348
C  6.591568 -0.318242 0.051542
C  -4.023516 -0.652944 0.329929
C  -4.608059 0.596465 0.449418
C  -4.499353 -1.578626 -0.582115
C  -5.685217 0.925692 -0.357252
C  -5.57833 -1.250719 -1.387489
C  -6.163681 0.001162 -1.274045
H  3.797585 2.756373 -0.904632
H  2.798228 -1.401196 -1.36426
H  3.017155 -1.841375 0.326234
H  3.616978 2.758501 1.481089
H  1.867616 2.465147 1.427241
H  0.776491 3.188741 -0.654698
H  1.753892 3.538205 -2.088418
H  2.017796 4.439729 -0.605191
H  0.223208 0.775353 -1.511255
H  -1.011502 -1.578539 2.628944
H  -2.116494 0.278912 -1.077347
H  4.928403 -0.536047 -2.604525
H  7.44518 -0.149971 0.690019
H  -4.238139 1.305444 1.178605
H  -4.043366 -2.557202 -0.653762
H  -6.155262 1.894835 -0.267608
H  -5.964629 -1.968703 -2.097176
H  5.033743 -0.706159 1.461774
totalener: -2045.04144851 hartree
nucrepener: 2730.93694071 hartree
electener: -4775.97838922 hartree
oneelecener: -8208.36073821 hartree
twoeener: 3432.38234899 hartree
kineticenergy: 2039.08411962 hartree
xcener: -150.082452656502 hartree
chargesum: 1.0000000
charge: -0.063940 -0.045283 -0.366883 -0.372619 -0.279106 0.101568 -0.044125 -0.275834 0.608489 0.102548 -0.203868 0.002161 -0.160622 -0.266682 0.004874 -0.161228 -0.192879 -0.169752 0.257766 0.153254 0.174066 0.199526 -0.161355 -0.157853 -0.113434 -0.111908 0.070565 0.082920 0.138280 0.179024 0.113431 0.101733 0.085848 0.106200 0.107047 0.157545 0.133779 0.142282 0.177966 0.193373 0.133919 0.133240 0.132743 0.132782 0.220443
qa: -0.0639 -0.0453 -0.3669 -0.3726 -0.2791 0.1016 -0.0441 -0.2758 0.6085 0.1025 -0.2039 0.0022 -0.1606 -0.2667 0.0049 -0.1612 -0.1929 -0.1698 0.2578 0.1533 0.1741 0.1995 -0.1614 -0.1579 -0.1134 -0.1119 0.0706 0.0829 0.1383 0.1790 0.1134 0.1017 0.0858 0.1062 0.1070 0.1575 0.1338 0.1423 0.1780 0.1934 0.1339 0.1332 0.1327 0.1328 0.2204
va: 1.2679 1.2589 2.0014 1.9577 2.1408 3.3741 3.4964 3.0632 3.8314 3.9135 3.7615 3.9060 3.4973 3.9805 4.0319 4.0008 4.1051 3.9988 3.9287 4.0121 3.9573 3.8069 4.0138 4.0251 3.9770 3.9766 3.9809 0.9993 1.0146 1.0110 1.0017 1.0098 1.0025 1.0052 1.0084 1.0117 1.0232 1.0109 0.9894 0.9768 1.0055 1.0066 1.0089 1.0088 1.0015
dispersion: -0.025201249 hartree
energy: -2045.066649762999 hartree
dipole: 21.14716 -14.79509 6.35207 13.09897 -13.05602 0.04295 -4.25653 4.31108 0.05456
magnitude: 6.35245 au
magnitude: 16.14664 debye
