program: Orca
programVersion: 5.0.2
elementType: Cl Cl O O O N N N C C C C C C C C C C C C C C C C C C C H H H H H H H H H H H H H H H H H H
charge: 1
multiplicity: 1
keywords: wb97x-d3
keywords: def2-TZVPP
keywords: def2/J RIJCOSX
keywords: DEFGRID2
keywords: scfconv7
keywords: smallprint printgap noloewdin
keywords: NOSOSCF
formula: C19H18Cl2N3O3
InChI: InChI=1/C19H18Cl2N3O3/c1-13-9-25-19(27-13,10-24-12-22-11-23-24)17-7-6-16(8-18(17)21)26-15-4-2-14(20)3-5-15/h2-8,11-13,23H,9-10H2,1H3
45 atoms
Cl 0.38215 2.288046 1.067726
Cl -7.023831 -0.22757 1.832898
O  3.750683 0.628682 -1.442277
O  2.767558 2.528081 -0.791992
O  -2.116599 -1.571659 -1.058555
N  3.531186 -0.385559 1.227798
N  4.232627 -1.259794 0.497851
N  3.333263 -2.361039 2.145906
C  2.822273 1.174443 -0.529221
C  3.964237 1.570476 -2.514544
C  3.426528 1.020889 0.877783
C  2.942756 2.657759 -2.189265
C  1.479098 0.469326 -0.650749
C  3.78288 0.920082 -3.86432
C  0.342111 0.898871 0.034028
C  1.334251 -0.66121 -1.456261
C  -0.875474 0.245277 -0.070009
C  0.135001 -1.329256 -1.581201
C  -0.982948 -0.87621 -0.885507
C  2.997218 -1.084625 2.219081
C  4.088423 -2.448804 1.070447
C  -3.253543 -1.220244 -0.361938
C  -4.155431 -0.33412 -0.924993
C  -3.497512 -1.798607 0.871574
C  -5.322717 -0.025629 -0.244773
C  -4.664335 -1.490534 1.551715
C  -5.571323 -0.603819 0.991102
H  4.983333 1.956946 -2.416215
H  2.797513 1.487719 1.632042
H  4.417073 1.476695 0.919918
H  3.297437 3.664248 -2.402524
H  1.998858 2.494677 -2.722434
H  4.489442 0.10515 -4.017591
H  3.964046 1.652579 -4.651402
H  2.771242 0.534752 -3.99323
H  2.181055 -1.026369 -2.019682
H  -1.729667 0.622728 0.475509
H  0.050143 -2.19704 -2.221116
H  2.373907 -0.63361 2.976045
H  4.544508 -3.34675 0.683119
H  -3.960542 0.100764 -1.896386
H  -2.792779 -2.502739 1.29347
H  -6.038813 0.657667 -0.67853
H  -4.871194 -1.944031 2.510677
H  4.630126 -0.964158 -0.3912
totalener: -2045.04150773 hartree
nucrepener: 2790.46676471 hartree
electener: -4835.50827243 hartree
oneelecener: -8326.79583706 hartree
twoeener: 3491.28756463 hartree
kineticenergy: 2039.07277545 hartree
xcener: -150.080890057181 hartree
chargesum: 1.0000000
charge: -0.027527 -0.041839 -0.429243 -0.301059 -0.276078 0.080453 -0.056852 -0.273505 0.569449 0.078507 -0.163703 0.027472 -0.169250 -0.261619 -0.078773 -0.118856 -0.121225 -0.232681 0.278638 0.172737 0.179638 0.197573 -0.160160 -0.161692 -0.110205 -0.113129 0.070148 0.092479 0.142771 0.152642 0.121249 0.088289 0.096415 0.112591 0.086124 0.144127 0.131272 0.141229 0.179402 0.189594 0.135972 0.131334 0.134872 0.132823 0.229591
qa: -0.0275 -0.0418 -0.4292 -0.3011 -0.2761 0.0805 -0.0569 -0.2735 0.5694 0.0785 -0.1637 0.0275 -0.1693 -0.2616 -0.0788 -0.1189 -0.1212 -0.2327 0.2786 0.1727 0.1796 0.1976 -0.1602 -0.1617 -0.1102 -0.1131 0.0701 0.0925 0.1428 0.1526 0.1212 0.0883 0.0964 0.1126 0.0861 0.1441 0.1313 0.1412 0.1794 0.1896 0.1360 0.1313 0.1349 0.1328 0.2296
va: 1.3119 1.2623 1.9049 2.0594 2.1465 3.3912 3.4589 3.0658 3.8586 3.9344 3.8148 3.9293 3.3917 3.9542 4.1971 3.8488 3.9039 4.1514 3.9045 3.9879 3.9626 3.8047 4.0187 4.0227 3.9767 3.9817 3.9891 1.0062 1.0309 1.0132 0.9966 1.0066 1.0058 1.0092 1.0031 1.0124 1.0302 1.0141 0.9866 0.9786 1.0059 1.0063 1.0083 1.0092 1.0160
dispersion: -0.025964202 hartree
energy: -2045.067471927740 hartree
dipole: 30.66300 -24.86146 5.80154 -1.08734 0.47772 -0.60962 -19.63159 19.15205 -0.47954
magnitude: 5.85315 au
magnitude: 14.87754 debye
