program: Orca
programVersion: 5.0.2
elementType: Cl Cl O O O N N N C C C C C C C C C C C C C C C C C C C H H H H H H H H H H H H H H H H H H
charge: 1
multiplicity: 1
keywords: wb97x-d3
keywords: def2-TZVPP
keywords: def2/J RIJCOSX
keywords: DEFGRID2
keywords: scfconv7
keywords: smallprint printgap noloewdin
keywords: NOSOSCF
formula: C19H18Cl2N3O3
InChI: InChI=1/C19H18Cl2N3O3/c1-13-9-25-19(27-13,10-24-12-22-11-23-24)17-7-6-16(8-18(17)21)26-15-4-2-14(20)3-5-15/h2-8,11-13,23H,9-10H2,1H3
45 atoms
Cl 0.474645 0.277308 1.847698
Cl -7.386814 0.181156 1.809174
O  3.298048 0.140374 -1.654806
O  2.69569 1.279455 0.157891
O  -2.87728 -1.074401 -1.703018
N  4.48331 -0.632073 0.82951
N  4.664572 0.214379 1.84866
N  6.615868 -0.159329 0.962992
C  2.538238 0.054427 -0.490331
C  3.461822 1.52236 -2.008408
C  3.164763 -1.043418 0.380851
C  2.72569 2.246315 -0.878015
C  1.083574 -0.271699 -0.765677
C  2.931018 1.82384 -3.389844
C  0.094504 -0.169379 0.210522
C  0.681164 -0.696126 -2.030938
C  -1.237953 -0.429445 -0.057622
C  -0.638677 -0.959995 -2.328045
C  -1.611184 -0.811208 -1.342606
C  5.68496 -0.830365 0.305797
C  5.962553 0.485699 1.90777
C  -3.914902 -0.764678 -0.852175
C  -4.612459 -1.796478 -0.25003
C  -4.27853 0.557177 -0.647465
C  -5.692095 -1.50414 0.56877
C  -5.350978 0.849575 0.178085
C  -6.051854 -0.182929 0.785203
H  4.534433 1.739934 -1.972557
H  3.283244 -1.95504 -0.202212
H  2.558022 -1.280997 1.253426
H  3.244044 3.133381 -0.517171
H  1.709529 2.529754 -1.173328
H  3.116637 2.869997 -3.636226
H  1.857156 1.649575 -3.457936
H  3.429794 1.220164 -4.146684
H  1.421444 -0.813846 -2.809706
H  -1.97059 -0.332173 0.731691
H  -0.927388 -1.276812 -3.320937
H  5.846174 -1.475479 -0.543866
H  6.392269 1.145077 2.646173
H  -4.327209 -2.824378 -0.430678
H  -3.739409 1.357573 -1.137932
H  -6.250178 -2.303072 1.036411
H  -5.646312 1.876569 0.341192
H  3.875259 0.612001 2.344403
totalener: -2045.04084997 hartree
nucrepener: 2748.17071068 hartree
electener: -4793.21156065 hartree
oneelecener: -8242.78034435 hartree
twoeener: 3449.56878370 hartree
kineticenergy: 2039.07995709 hartree
xcener: -150.082013859195 hartree
chargesum: 1.0000000
charge: -0.065593 -0.046038 -0.364885 -0.370878 -0.276071 0.100354 -0.042032 -0.275497 0.605651 0.104058 -0.211591 0.002264 -0.162046 -0.268178 -0.039820 -0.123019 -0.148134 -0.205095 0.262121 0.150449 0.174151 0.211338 -0.174167 -0.172738 -0.100064 -0.106281 0.061796 0.085195 0.140346 0.180047 0.114300 0.100349 0.106892 0.085901 0.106579 0.157800 0.131961 0.142546 0.179549 0.193150 0.134960 0.135463 0.133059 0.132206 0.219643
qa: -0.0656 -0.0460 -0.3649 -0.3709 -0.2761 0.1004 -0.0420 -0.2755 0.6057 0.1041 -0.2116 0.0023 -0.1620 -0.2682 -0.0398 -0.1230 -0.1481 -0.2051 0.2621 0.1504 0.1742 0.2113 -0.1742 -0.1727 -0.1001 -0.1063 0.0618 0.0852 0.1403 0.1800 0.1143 0.1003 0.1069 0.0859 0.1066 0.1578 0.1320 0.1425 0.1795 0.1932 0.1350 0.1355 0.1331 0.1322 0.2196
va: 1.2707 1.2579 2.0042 1.9644 2.1466 3.3671 3.4983 3.0619 3.8291 3.9083 3.7643 3.9044 3.4637 3.9824 4.0912 3.9390 3.9454 4.0818 3.9100 4.0113 3.9578 3.7965 4.0415 4.0061 3.9692 3.9755 3.9887 0.9990 1.0156 1.0086 1.0019 1.0093 1.0087 1.0022 1.0051 1.0081 1.0244 1.0131 0.9896 0.9769 1.0083 1.0027 1.0083 1.0092 1.0012
dispersion: -0.025410502 hartree
energy: -2045.066260468130 hartree
dipole: 27.26145 -21.15054 6.11091 5.01657 -4.71800 0.29856 -18.50601 19.18913 0.68312
magnitude: 6.15622 au
magnitude: 15.64787 debye
