program: Orca
programVersion: 5.0.2
elementType: Cl Cl O O O N N N C C C C C C C C C C C C C C C C C C C H H H H H H H H H H H H H H H H H H
charge: 1
multiplicity: 1
keywords: wb97x-d3
keywords: def2-TZVPP
keywords: def2/J RIJCOSX
keywords: DEFGRID2
keywords: scfconv7
keywords: smallprint printgap noloewdin
keywords: NOSOSCF
formula: C19H18Cl2N3O3
InChI: InChI=1/C19H18Cl2N3O3/c1-13-9-25-19(27-13,10-24-12-22-11-23-24)17-7-6-16(8-18(17)21)26-15-4-2-14(20)3-5-15/h2-8,11-13,23H,9-10H2,1H3
45 atoms
Cl 2.615388 -2.267647 -1.888046
Cl -6.713055 1.09954 1.85402
O  3.753858 0.505364 -2.001404
O  3.10927 1.985057 -0.476313
O  -2.146942 -1.534951 -0.687327
N  3.373856 -0.013758 1.562932
N  3.150586 1.143046 2.196582
N  2.292091 -0.441026 3.41642
C  3.106732 0.61718 -0.791462
C  3.482178 1.678293 -2.769707
C  3.994138 -0.082418 0.251325
C  2.999516 2.689953 -1.710804
C  1.691863 0.052359 -0.779673
C  2.473928 1.419532 -3.868231
C  1.388173 -1.229826 -1.247785
C  0.636349 0.791403 -0.254082
C  0.104712 -1.736178 -1.205334
C  -0.660483 0.309553 -0.198487
C  -0.931169 -0.965997 -0.681157
C  2.836102 -0.954461 2.326434
C  2.489929 0.856309 3.312076
C  -3.202315 -0.888053 -0.081134
C  -4.066104 -0.129924 -0.852165
C  -3.407952 -1.04075 1.279847
C  -5.154077 0.484925 -0.252932
C  -4.494097 -0.424485 1.87966
C  -5.361172 0.338083 1.110422
H  4.434186 1.989417 -3.205298
H  4.980435 0.382277 0.29301
H  4.117542 -1.136518 0.012315
H  3.622252 3.581991 -1.651572
H  1.963741 2.99553 -1.88755
H  1.507796 1.110472 -3.467629
H  2.827996 0.644944 -4.546644
H  2.321886 2.326129 -4.455366
H  0.817274 1.792336 0.113824
H  -0.105372 -2.729077 -1.580003
H  -1.445472 0.931335 0.20891
H  2.861803 -1.999967 2.059559
H  2.177239 1.609334 4.018875
H  -3.903464 -0.032292 -1.917477
H  -2.737238 -1.652652 1.869191
H  -5.841333 1.071372 -0.846426
H  -4.670957 -0.544987 2.939326
H  3.370392 2.024884 1.74404
totalener: -2045.03887847 hartree
nucrepener: 2804.32688315 hartree
electener: -4849.36576162 hartree
oneelecener: -8354.36805046 hartree
twoeener: 3505.00228884 hartree
kineticenergy: 2039.07062265 hartree
xcener: -150.080635748264 hartree
chargesum: 1.0000000
charge: -0.025094 -0.042598 -0.317067 -0.413833 -0.277446 0.078587 -0.048290 -0.270742 0.622622 0.193548 -0.163228 -0.089764 -0.263925 -0.287884 -0.007330 -0.130963 -0.167720 -0.189624 0.259380 0.173310 0.175827 0.201695 -0.161308 -0.159578 -0.110510 -0.117094 0.069502 0.099815 0.152799 0.143843 0.116390 0.110364 0.083608 0.108917 0.105048 0.139667 0.135728 0.142458 0.178895 0.191050 0.136771 0.131279 0.134470 0.132613 0.225811
qa: -0.0251 -0.0426 -0.3171 -0.4138 -0.2774 0.0786 -0.0483 -0.2707 0.6226 0.1935 -0.1632 -0.0898 -0.2639 -0.2879 -0.0073 -0.1310 -0.1677 -0.1896 0.2594 0.1733 0.1758 0.2017 -0.1613 -0.1596 -0.1105 -0.1171 0.0695 0.0998 0.1528 0.1438 0.1164 0.1104 0.0836 0.1089 0.1050 0.1397 0.1357 0.1425 0.1789 0.1911 0.1368 0.1313 0.1345 0.1326 0.2258
va: 1.3072 1.2617 2.0541 1.9206 2.1423 3.3889 3.4697 3.0627 3.7944 3.8175 3.8038 3.9623 3.4447 3.9895 4.0941 3.8812 4.0773 4.0541 3.9194 3.9882 3.9642 3.8007 4.0187 4.0145 3.9721 3.9807 3.9846 0.9966 1.0182 1.0268 1.0048 0.9941 0.9939 1.0089 1.0103 1.0197 1.0241 1.0104 0.9871 0.9782 1.0064 1.0056 1.0082 1.0093 1.0095
dispersion: -0.026623501 hartree
energy: -2045.065501973164 hartree
dipole: 19.32650 -14.96917 4.35732 12.57567 -10.79081 1.78486 -9.05787 10.49302 1.43515
magnitude: 4.92257 au
magnitude: 12.51217 debye
