program: Gaussian 09
title: 000070983
version: EM64L-G09RevD.01
frameworkgroup: C1[X(C10H13NO)]
method: RPBEPBE
basis: SDD
operation: Freq
keyword: #p
keyword: freq=noraman
keyword: PBEPBE/SDD
title: #p freq=noraman PBEPBE/SDD
converged: YES YES NO NO
title: Mulliken charges:
elementType: O N C C C C C C C C C C H H H H H H H H H H H H H
charge: -0.239219 -0.154049 0.432351 0.381880 -0.563608 0.243833 -0.365446 -0.382063 -0.643387 -0.645241 -0.838895 -0.251290 0.240624 0.241934 0.267982 0.240488 0.218513 0.239908 0.220734 0.238403 0.239209 0.226854 0.236511 0.236552 0.177423
chargesum: 0.00000
title: Mulliken charges with hydrogens summed into heavy atoms:
elementType: O N C C C C C C C C C C
charge: -0.239219 -0.154049 0.432351 0.381880 -0.322984 0.243833 -0.123512 -0.114081 0.055522 0.053105 -0.138978 -0.073867
polarizability: 2.08064058e+02 3.98715469e+00 1.23756313e+02 3.77618742e-02 9.76870294e-02 6.22506092e+01
1716.lowfreq: -12.9546 -8.0243 -0.0008 -0.0007 0.0006 8.7392 65.9250 79.4003 116.6135
frequency: 65.7809 79.2943 116.5950 136.8868 164.0407 167.2289 170.5875 205.5306 234.6420 256.3950 320.2214 338.8490 347.4251 457.0083 459.8452 494.8366 542.7032 586.4424 601.7081 687.7433 732.6987 797.3534 820.5906 853.5295 873.6999 955.7712 957.9861 995.4389 1013.5973 1042.1913 1056.9999 1105.2054 1105.9776 1112.4747 1156.8136 1203.2022 1248.7000 1257.3696 1287.1011 1363.3746 1372.1754 1396.8309 1404.5707 1431.6344 1445.7756 1462.4091 1466.0757 1472.2374 1478.2542 1480.1701 1492.7934 1501.9684 1523.1695 1544.8709 1586.9704 1633.1275 2891.7345 2948.4987 2956.1733 2981.4233 3016.7573 3021.3339 3060.8497 3084.4508 3100.0845 3110.4487 3138.1443 3150.5937 3169.1961
redmass: 3.2752 3.1732 1.4943 1.2455 1.9573 4.2991 1.3714 1.6102 3.6156 2.3677 4.1660 3.2713 3.2394 3.7745 2.7383 3.8388 4.0374 3.0951 4.4292 5.5996 2.6079 4.6295 1.4062 1.6205 4.9948 2.2481 1.6131 1.4488 1.6018 1.5860 1.5129 2.1223 1.2872 1.3279 1.4797 1.7739 2.2235 3.2229 1.6352 3.1570 2.1072 1.3774 1.8219 1.2606 1.8575 1.3201 1.0398 1.0465 1.0464 1.2480 1.2046 1.2383 2.2505 6.2722 5.2414 6.3449 1.0839 1.0368 1.0391 1.0373 1.1001 1.1024 1.0975 1.0987 1.0967 1.0947 1.0885 1.0898 1.0944
irintensity: 0.1831 0.3750 5.0700 5.8763 4.6632 3.1686 0.2812 0.3619 2.4481 1.3718 1.8481 9.3396 1.6849 3.0308 9.7738 8.5507 1.0869 1.5055 9.2379 5.7016 1.2494 28.5441 32.3425 32.2186 2.3147 6.9710 3.4696 3.7331 3.5633 6.9535 25.3213 42.3805 2.9863 1.0606 1.2136 9.1980 32.0551 23.0144 114.7228 143.4328 98.4938 14.8315 10.3679 5.9652 2.9138 15.1833 0.3010 16.5458 19.3834 4.4308 8.0584 19.9235 242.4766 26.8562 506.4276 238.9543 125.7853 89.5322 91.9177 30.7606 17.6835 60.1087 16.7317 20.6407 4.2576 40.5878 0.4923 16.7394 15.8804
temp: 298.150 k
press: 1.00000 atm
elementType: 8 7 6 6 6 6 6 6 6 6 6 6 1 1 1 1 1 1 1 1 1 1 1 1 1
symmnumber: 1
zpe: 542485.9 jmol-1
zpe.correction: 0.206622 hartree
zpe.thermalcorrener: 0.219136 hartree
zpe.thermalcorrenthalpy: 0.220080 hartree
zpe.thermalcorrgfe: 0.168170 hartree
zpe.sumelectzpe: -517.932840 hartree
zpe.sumelectthermal: -517.920327 hartree
zpe.sumelectthermalent: -517.919382 hartree
zpe.sumelectthermalfe: -517.971293 hartree
dipole: 6.9219 2.7293 0.0048
dipole: 7.4406
quadrupole: -74.1601 -67.2470 -75.0587
quadrupole: -11.8792 -0.0139 -0.0164
quadrupole: -2.0048 4.9083 -2.9035 -11.8792 -0.0139 -0.0164
hfenergy: -518.1394622 hartree
pointgroup: C01 [X(C10H13N1O1)]
dipole: 2.7419502 -1.0200921 -0.1022122 debye
dipolederiv: -1.2186056 0.2258281 0.0270895 0.8974737 -0.6853782 -0.0334537 0.0635711 -0.0219249 -0.3543754 -1.8748031 -0.0058732 0.0265036 0.0022991 -0.5001877 -0.014878 0.0213043 -0.007526 -0.2813097 1.8118069 0.009477 -0.0265556 0.007169 0.081092 -0.0012211 -0.0251932 -0.0027486 0.1589912 0.7183399 0.0161257 -0.010944 -0.1646819 0.4000292 0.02572 -0.0210613 0.0225713 -0.0110204 -0.7485476 -0.0926368 0.0022883 -0.5560263 -0.1022437 0.0185837 -0.0207895 0.0111533 -0.2577555 -1.4298008 0.083083 0.0278371 -0.2205461 -0.3626282 -0.0127647 0.0115158 -0.0186498 -0.0584357 -0.6790155 0.0415179 0.0098799 0.4778159 -0.0501136 0.0031741 0.0313288 0.0111935 -0.2508447 0.5730272 0.0628323 -0.0080866 0.3003244 0.1073193 0.0056791 0.0052434 0.0097107 -0.0873561 0.3516999 0.1531252 0.0060023 0.4760224 0.4308331 0.0040766 0.0213154 0.0095665 0.2448648 0.3435597 -0.155362 -0.0104601 -0.4722342 0.4272937 0.0216791 -0.0227741 0.0163049 0.2489636 0.0161169 -0.1594335 -0.0081603 -0.0970081 -0.0881447 -0.006573 -0.0054157 -0.0052356 0.0586661 2.0278619 -0.2177328 -0.0451824 -0.4973747 0.7414134 0.0444133 -0.0604403 0.0398865 0.0792408 0.0344577 0.0760987 0.0067477 0.0948332 -0.0713057 -0.014742 0.0081325 -0.0147744 0.1558539 0.0156916 -0.0961707 -0.0030813 -0.0903826 -0.0495011 -0.0105507 -0.0033511 -0.0109767 0.1644977 0.0820506 0.0794464 0.0055379 0.0191019 -0.0073508 -0.0088652 0.0028193 -0.0096541 0.1441501 0.0870579 0.0544221 -0.0703095 -0.130995 -0.0752654 0.0908554 0.0169187 0.1169795 -0.0667083 -0.1725857 0.0042993 0.0082879 0.0988152 0.0874334 -0.0051416 0.0125451 -0.0030872 0.1168779 0.0877491 0.0386999 0.0647925 -0.1371603 -0.0554915 -0.0853895 -0.040195 -0.1202881 -0.0929817 -0.1741382 -0.0066721 -0.0004416 -0.0975213 0.088309 -0.003028 -0.0046225 -0.0036505 0.1173371 0.0857617 -0.0415418 -0.0714178 0.1361357 -0.0578715 -0.0908924 0.0347241 -0.1220565 -0.0957271 0.0897364 -0.0524262 0.0677017 0.1317686 -0.0787435 0.0873071 -0.0187264 0.120201 -0.0680631 -0.0055378 0.1873358 0.0122772 0.0537172 -0.0526394 -0.0096392 0.0048559 -0.011943 0.1020471 0.0069571 -0.061506 0.1027961 -0.0118578 0.0428 -0.0044752 0.1041227 0.0429308 -0.0365398 -0.0003379 -0.0508079 -0.1103302 0.0000707 0.0459654 0.0135869 -0.1060877 -0.0322345 -0.0325827 -0.0285024 -0.0921286 -0.0027721 -0.2197587 -0.2156236 -0.013461 -0.0097402 -0.0157483 0.10221 unknown
polarizability: 208.1394469|-2.314323|123.4490242|-2.5947065|3.4132221|62.4825085 unknown
InChI: InChI=1S/C10H13NO/c1-8-6-10(11(2)3)5-4-9(8)7-12/h4-7H,1-3H3
charge 0 multiplicity 1
25 atoms
O  -3.756536 1.258085 0.17583
N  2.655242 0.125975 0.007203
C  1.26253 0.131998 0.029644
C  -0.891332 -1.112293 -0.003181
C  0.51575 -1.091108 -0.026183
C  -1.607602 0.128182 0.077917
C  0.528832 1.363718 0.109877
C  -0.867288 1.344528 0.132377
C  3.400694 1.39323 0.051562
C  3.391603 -1.144279 -0.06391
C  -1.609417 -2.453868 -0.066489
C  -3.077871 0.187291 0.106325
H  1.045396 -2.046221 -0.090893
H  1.054338 2.321148 0.155476
H  -1.438927 2.277847 0.19414
H  3.145587 2.048078 -0.805205
H  4.480676 1.183675 0.007996
H  3.19948 1.955661 0.985163
H  4.473679 -0.941625 -0.048437
H  3.162022 -1.701838 -0.994351
H  3.156028 -1.801814 0.796645
H  -0.882897 -3.281912 -0.125095
H  -2.23987 -2.62502 0.825537
H  -2.269794 -2.525086 -0.950438
H  -3.607923 -0.795051 0.06219
