program: Orca
programVersion: 5.0.2
elementType: Cl Cl O O O N N N C C C C C C C C C C C C C C C C C C C H H H H H H H H H H H H H H H H H H
charge: 1
multiplicity: 1
keywords: wb97x-d3
keywords: def2-TZVPP
keywords: def2/J RIJCOSX
keywords: DEFGRID2
keywords: scfconv7
keywords: smallprint printgap noloewdin
keywords: NOSOSCF
formula: C19H18Cl2N3O3
InChI: InChI=1/C19H18Cl2N3O3/c1-13-9-25-19(27-13,10-24-12-22-11-23-24)17-7-6-16(8-18(17)21)26-15-4-2-14(20)3-5-15/h2-8,11-13,23H,9-10H2,1H3
45 atoms
Cl 1.895974 -2.36764 -1.428773
Cl -7.763406 1.497482 0.436208
O  3.145599 0.277852 -1.052979
O  2.49868 1.62623 0.585975
O  -2.865626 -1.644351 -0.205306
N  4.596872 -0.101093 1.287014
N  5.535835 -0.4381 0.399058
N  6.439709 0.950235 1.803386
C  2.46037 0.302218 0.15898
C  2.990739 1.54572 -1.694975
C  3.219319 -0.536647 1.19071
C  2.439079 2.441551 -0.575114
C  1.032884 -0.217875 0.037492
C  2.088227 1.46022 -2.904889
C  0.697269 -1.385023 -0.649239
C  -0.00544 0.46301 0.665192
C  -0.609171 -1.830307 -0.736232
C  -1.320938 0.036673 0.6029
C  -1.621226 -1.115039 -0.110543
C  5.171474 0.751409 2.120978
C  6.640516 0.202131 0.731248
C  -3.975504 -0.857103 -0.042391
C  -4.176748 0.280187 -0.812222
C  -4.931259 -1.273897 0.869159
C  -5.344367 1.010194 -0.660434
C  -6.105289 -0.550983 1.013446
C  -6.3009 0.589066 0.251347
H  3.988066 1.868999 -2.002222
H  3.206732 -1.597657 0.947659
H  2.773155 -0.413117 2.176525
H  3.04581 3.329861 -0.402459
H  1.410841 2.75781 -0.778917
H  1.077932 1.147017 -2.637209
H  2.482437 0.762705 -3.6443
H  2.019149 2.439624 -3.38105
H  0.21269 1.358578 1.230798
H  -0.848495 -2.733986 -1.281654
H  -2.087909 0.600601 1.116665
H  4.637857 1.193632 2.947596
H  7.560589 0.099873 0.178304
H  -3.4361 0.599464 -1.534785
H  -4.767423 -2.165139 1.461162
H  -5.504678 1.896025 -1.260056
H  -6.855084 -0.878153 1.720893
H  5.347528 -1.082677 -0.363934
elementType: Cl O N C H
totalener: -2045.13900590 hartree
nucrepener: 2732.06290877 hartree
electener: -4777.20191466 hartree
oneelecener: -8210.14520307 hartree
twoeener: 3432.94328841 hartree
cpcmener: -0.10247944 hartree
kineticenergy: 2039.03048708 hartree
xcener: -150.073456041186 hartree
chargesum: 1.0000000
charge: -0.076780 -0.093608 -0.388668 -0.388890 -0.316834 0.103605 -0.032740 -0.359825 0.615090 0.206208 -0.106051 -0.034217 -0.191319 -0.303091 0.019345 -0.118797 -0.218604 -0.220403 0.284484 0.161826 0.192231 0.276541 -0.197767 -0.238672 -0.123657 -0.107483 0.067198 0.089323 0.169167 0.145779 0.112120 0.103618 0.087567 0.092656 0.106725 0.150800 0.127979 0.155995 0.195624 0.204657 0.160845 0.149487 0.145910 0.144902 0.247724
qa: -0.0768 -0.0936 -0.3887 -0.3889 -0.3168 0.1036 -0.0327 -0.3598 0.6151 0.2062 -0.1061 -0.0342 -0.1913 -0.3031 0.0193 -0.1188 -0.2186 -0.2204 0.2845 0.1618 0.1922 0.2765 -0.1978 -0.2387 -0.1237 -0.1075 0.0672 0.0893 0.1692 0.1458 0.1121 0.1036 0.0876 0.0927 0.1067 0.1508 0.1280 0.1560 0.1956 0.2047 0.1608 0.1495 0.1459 0.1449 0.2477
va: 1.2413 1.2095 1.9768 1.9825 2.0950 3.3821 3.5131 3.0456 3.8546 3.8290 3.7267 3.9292 3.5937 3.9885 3.9615 3.9441 4.1146 3.9774 3.8042 4.0032 3.9464 3.7013 3.9768 4.0466 3.9574 3.9491 3.8581 1.0034 1.0061 1.0085 1.0014 0.9982 0.9961 1.0082 1.0072 1.0199 1.0277 0.9996 0.9831 0.9727 0.9944 1.0049 1.0033 1.0025 0.9752
dispersion: -0.025384415 hartree
energy: -2045.164390312660 hartree
dipole: 21.70245 -13.79038 7.91207 9.64543 -9.53167 0.11376 -3.50419 4.28106 0.77687
magnitude: 7.95093 au
magnitude: 20.20966 debye
