program: Orca
programVersion: 5.0.2
elementType: Cl Cl O O O N N N C C C C C C C C C C C C C C C C C C C H H H H H H H H H H H H H H H H H H
charge: 1
multiplicity: 1
keywords: wb97x-d3
keywords: def2-TZVPP
keywords: def2/J RIJCOSX
keywords: DEFGRID2
keywords: scfconv7
keywords: smallprint printgap noloewdin
keywords: NOSOSCF
formula: C19H18Cl2N3O3
InChI: InChI=1/C19H18Cl2N3O3/c1-13-9-25-19(27-13,10-24-12-22-11-23-24)17-7-6-16(8-18(17)21)26-15-4-2-14(20)3-5-15/h2-8,11-13,23H,9-10H2,1H3
45 atoms
Cl 1.934103 -2.590158 -0.899234
Cl -7.753819 1.532672 0.284224
O  3.160836 0.069362 -1.046539
O  2.459318 1.738844 0.234656
O  -2.860824 -1.670813 0.018929
N  4.600382 0.143585 1.281511
N  5.0541 1.369308 1.554486
N  6.748462 0.184973 0.889327
C  2.451601 0.348483 0.116067
C  2.987694 1.155533 -1.960766
C  3.200274 -0.226273 1.320525
C  2.377973 2.259651 -1.084116
C  1.030596 -0.203469 0.09104
C  2.123404 0.774772 -3.141059
C  0.712687 -1.483179 -0.363632
C  -0.021743 0.573839 0.564396
C  -0.590704 -1.944403 -0.395768
C  -1.334525 0.134128 0.558829
C  -1.618716 -1.128981 0.058721
C  5.649178 -0.549916 0.869687
C  6.352553 1.370528 1.317632
C  -3.974722 -0.874451 0.080176
C  -4.921446 -1.166179 1.047857
C  -4.186686 0.146397 -0.836339
C  -6.094786 -0.429913 1.106227
C  -5.35252 0.891857 -0.770554
C  -6.297173 0.599998 0.202147
H  3.984107 1.436785 -2.309397
H  3.169849 -1.313583 1.330654
H  2.759871 0.130326 2.251302
H  2.937675 3.193403 -1.12133
H  1.33826 2.466191 -1.358045
H  1.116146 0.489745 -2.833475
H  2.560895 -0.050394 -3.703132
H  2.037114 1.624792 -3.820144
H  0.180663 1.561389 0.955986
H  -0.814879 -2.936208 -0.766521
H  -2.111372 0.779423 0.946001
H  5.57092 -1.583822 0.572885
H  6.971057 2.240843 1.467201
H  -4.750581 -1.971206 1.750865
H  -3.455031 0.365103 -1.604023
H  -6.837017 -0.660189 1.858354
H  -5.520305 1.689718 -1.481267
H  4.445217 2.111504 1.885155
elementType: Cl O N C H
totalener: -2045.13876388 hartree
nucrepener: 2733.17239029 hartree
electener: -4778.31115417 hartree
oneelecener: -8212.49635635 hartree
twoeener: 3434.18520218 hartree
cpcmener: -0.10381220 hartree
kineticenergy: 2039.03825350 hartree
xcener: -150.074719711257 hartree
chargesum: 1.0000000
charge: -0.073355 -0.093450 -0.373782 -0.395641 -0.315356 0.103547 -0.028745 -0.357526 0.592654 0.204002 -0.098360 -0.034040 -0.180355 -0.302857 0.016364 -0.131498 -0.218717 -0.227174 0.296524 0.166789 0.190262 0.279442 -0.235389 -0.204954 -0.108035 -0.121224 0.067032 0.090344 0.145711 0.164288 0.112095 0.103499 0.087174 0.093781 0.106239 0.150500 0.127296 0.156329 0.194368 0.204954 0.149588 0.161163 0.144927 0.145324 0.246265
qa: -0.0734 -0.0934 -0.3738 -0.3956 -0.3154 0.1035 -0.0287 -0.3575 0.5927 0.2040 -0.0984 -0.0340 -0.1804 -0.3029 0.0164 -0.1315 -0.2187 -0.2272 0.2965 0.1668 0.1903 0.2794 -0.2354 -0.2050 -0.1080 -0.1212 0.0670 0.0903 0.1457 0.1643 0.1121 0.1035 0.0872 0.0938 0.1062 0.1505 0.1273 0.1563 0.1944 0.2050 0.1496 0.1612 0.1449 0.1453 0.2463
va: 1.2455 1.2095 1.9804 1.9694 2.0989 3.3804 3.5128 3.0418 3.8708 3.8307 3.7247 3.9269 3.5883 3.9847 3.9750 3.9553 4.1134 3.9726 3.7989 4.0010 3.9485 3.6959 4.0458 3.9804 3.9480 3.9549 3.8575 1.0006 1.0135 1.0011 1.0019 0.9990 0.9958 1.0083 1.0075 1.0203 1.0282 0.9997 0.9836 0.9726 1.0047 0.9943 1.0024 1.0035 0.9780
dispersion: -0.025423425 hartree
energy: -2045.164187306216 hartree
dipole: 20.99696 -13.77145 7.22551 10.37334 -7.83837 2.53497 -4.67077 6.79506 2.12429
magnitude: 7.94649 au
magnitude: 20.19837 debye
