program: Orca
programVersion: 5.0.2
elementType: Cl Cl O O O N N N C C C C C C C C C C C C C C C C C C C H H H H H H H H H H H H H H H H H H
charge: 1
multiplicity: 1
keywords: wb97x-d3
keywords: def2-TZVPP
keywords: def2/J RIJCOSX
keywords: DEFGRID2
keywords: scfconv7
keywords: smallprint printgap noloewdin
keywords: NOSOSCF
formula: C19H18Cl2N3O3
InChI: InChI=1/C19H18Cl2N3O3/c1-13-9-25-19(27-13,10-24-12-22-11-23-24)17-7-6-16(8-18(17)21)26-15-4-2-14(20)3-5-15/h2-8,11-13,23H,9-10H2,1H3
45 atoms
Cl 0.353987 2.471587 0.746676
Cl -6.994685 -0.439486 2.073631
O  3.735089 0.496045 -1.511162
O  2.776804 2.455996 -0.96222
O  -2.2084 -1.478254 -1.134206
N  3.446283 -0.439872 1.194401
N  4.256809 -1.349463 0.643254
N  3.010781 -2.384723 2.091745
C  2.827006 1.103411 -0.635557
C  4.139645 1.442071 -2.508722
C  3.398938 0.952167 0.792135
C  3.895566 2.755064 -1.786466
C  1.450943 0.465837 -0.752262
C  3.346715 1.279383 -3.787615
C  0.305912 0.995818 -0.163061
C  1.301235 -0.734504 -1.444943
C  -0.93355 0.381907 -0.265547
C  0.083212 -1.375668 -1.551804
C  -1.040604 -0.814427 -0.960639
C  2.698235 -1.100022 2.066173
C  3.978102 -2.513874 1.199956
C  -3.300147 -1.191514 -0.353767
C  -4.453261 -0.750861 -0.98144
C  -3.272358 -1.400767 1.017675
C  -5.598392 -0.522359 -0.233568
C  -4.411729 -1.160994 1.768306
C  -5.567468 -0.725895 1.136429
H  5.201587 1.277372 -2.697552
H  2.778041 1.457572 1.528123
H  4.404792 1.370664 0.849142
H  4.759465 3.059026 -1.186546
H  3.625244 3.575851 -2.450407
H  2.289212 1.511229 -3.650346
H  3.428954 0.263017 -4.173677
H  3.740143 1.952654 -4.550442
H  2.160667 -1.190285 -1.915101
H  -1.797635 0.846441 0.190267
H  0.002049 -2.307826 -2.095588
H  1.942806 -0.608749 2.660119
H  4.495346 -3.42239 0.935284
H  -4.465064 -0.593536 -2.052377
H  -2.372862 -1.754602 1.505999
H  -6.50187 -0.183715 -0.722598
H  -4.394807 -1.32301 2.837594
H  4.932781 -1.106069 -0.075372
elementType: Cl O N C H
totalener: -2045.13679840 hartree
nucrepener: 2786.63813854 hartree
electener: -4831.77493693 hartree
oneelecener: -8318.96865454 hartree
twoeener: 3487.19371761 hartree
cpcmener: -0.10562219 hartree
kineticenergy: 2039.01372424 hartree
xcener: -150.069698566601 hartree
chargesum: 1.0000000
charge: -0.069786 -0.092003 -0.420809 -0.361484 -0.313358 0.085550 -0.019427 -0.351478 0.568056 0.172262 -0.131629 0.010930 -0.121451 -0.303203 -0.052026 -0.084900 -0.146271 -0.267330 0.306818 0.175897 0.190863 0.259668 -0.220435 -0.193134 -0.117029 -0.127163 0.075303 0.090595 0.137062 0.154979 0.092328 0.105126 0.097007 0.093719 0.105093 0.148099 0.129402 0.147182 0.194389 0.204083 0.150083 0.159833 0.146144 0.145987 0.246459
qa: -0.0698 -0.0920 -0.4208 -0.3615 -0.3134 0.0855 -0.0194 -0.3515 0.5681 0.1723 -0.1316 0.0109 -0.1215 -0.3032 -0.0520 -0.0849 -0.1463 -0.2673 0.3068 0.1759 0.1909 0.2597 -0.2204 -0.1931 -0.1170 -0.1272 0.0753 0.0906 0.1371 0.1550 0.0923 0.1051 0.0970 0.0937 0.1051 0.1481 0.1294 0.1472 0.1944 0.2041 0.1501 0.1598 0.1461 0.1460 0.2465
va: 1.2574 1.2106 1.9542 2.0116 2.1018 3.3860 3.4947 3.0399 3.8765 3.9126 3.8799 3.9942 3.4948 3.9547 4.0864 3.8137 3.9510 4.0973 3.7921 3.9813 3.9513 3.7128 4.0405 3.9823 3.9532 3.9589 3.8539 1.0003 1.0192 0.9974 0.9975 0.9924 0.9991 1.0071 1.0084 1.0223 1.0277 1.0093 0.9815 0.9733 1.0038 0.9944 1.0024 1.0034 0.9813
dispersion: -0.026074314 hartree
energy: -2045.162872710506 hartree
dipole: 31.97430 -23.76055 8.21376 -0.25432 -0.58665 -0.84097 -17.69394 17.57923 -0.11471
magnitude: 8.25749 au
magnitude: 20.98888 debye
