program: Orca
programVersion: 5.0.2
elementType: Cl Cl O O O N N N C C C C C C C C C C C C C C C C C C C H H H H H H H H H H H H H H H H H H
charge: 1
multiplicity: 1
keywords: wb97x-d3
keywords: def2-TZVPP
keywords: def2/J RIJCOSX
keywords: DEFGRID2
keywords: scfconv7
keywords: smallprint printgap noloewdin
keywords: NOSOSCF
formula: C19H18Cl2N3O3
InChI: InChI=1/C19H18Cl2N3O3/c1-13-9-25-19(27-13,10-24-12-22-11-23-24)17-7-6-16(8-18(17)21)26-15-4-2-14(20)3-5-15/h2-8,11-13,23H,9-10H2,1H3
45 atoms
Cl 2.362987 -2.399797 -1.845538
Cl -6.739611 0.733856 2.499213
O  3.554601 0.312537 -2.148732
O  2.86091 1.94889 -0.766913
O  -2.395591 -1.50296 -0.727618
N  3.115176 0.085214 1.458836
N  3.011369 1.252356 2.10243
N  1.906658 -0.22304 3.253592
C  2.896126 0.561252 -0.946777
C  3.661418 1.53784 -2.878353
C  3.759001 -0.066353 0.169303
C  3.70024 2.549323 -1.747377
C  1.474466 0.016948 -0.914293
C  2.510401 1.727902 -3.844666
C  1.155152 -1.289848 -1.284244
C  0.426982 0.810657 -0.455458
C  -0.136112 -1.779298 -1.207078
C  -0.875335 0.34822 -0.367416
C  -1.155104 -0.956812 -0.745705
C  2.425581 -0.789018 2.176635
C  2.285012 1.041862 3.185307
C  -3.381379 -0.939899 0.04328
C  -4.51994 -0.46837 -0.588116
C  -3.266765 -0.902672 1.425849
C  -5.563295 0.04304 0.169338
C  -4.30338 -0.383539 2.183668
C  -5.443885 0.08688 1.54921
H  4.607136 1.504619 -3.421721
H  4.740536 0.408187 0.206087
H  3.90307 -1.134574 0.022811
H  4.714783 2.689796 -1.360507
H  3.2861 3.522669 -2.011041
H  2.686088 2.614226 -4.455845
H  1.554536 1.858772 -3.334205
H  2.424384 0.874771 -4.518535
H  0.619391 1.832207 -0.160135
H  -0.358583 -2.795879 -1.504371
H  -1.650741 1.014872 -0.014645
H  2.331278 -1.822805 1.881362
H  2.058316 1.822905 3.893437
H  -4.60119 -0.506048 -1.66706
H  -2.379652 -1.28191 1.918051
H  -6.455712 0.407641 -0.321504
H  -4.219394 -0.355248 3.261792
H  3.458975 2.098876 1.761941
elementType: Cl O N C H
totalener: -2045.13653846 hartree
nucrepener: 2796.14550066 hartree
electener: -4841.28203912 hartree
oneelecener: -8337.78970511 hartree
twoeener: 3496.50766599 hartree
cpcmener: -0.10626880 hartree
kineticenergy: 2039.00621662 hartree
xcener: -150.068233251688 hartree
chargesum: 1.0000000
charge: -0.070669 -0.092647 -0.371189 -0.394904 -0.317120 0.092601 -0.021550 -0.352863 0.492280 0.191595 -0.126888 0.003141 -0.120342 -0.302259 0.049365 -0.139315 -0.212290 -0.193685 0.283690 0.173089 0.191311 0.251247 -0.215961 -0.181069 -0.119715 -0.133048 0.077546 0.097307 0.150905 0.145275 0.095247 0.105649 0.100633 0.094523 0.094411 0.146401 0.127123 0.154930 0.194660 0.204236 0.150441 0.157920 0.146769 0.146448 0.246772
qa: -0.0707 -0.0926 -0.3712 -0.3949 -0.3171 0.0926 -0.0215 -0.3529 0.4923 0.1916 -0.1269 0.0031 -0.1203 -0.3023 0.0494 -0.1393 -0.2123 -0.1937 0.2837 0.1731 0.1913 0.2512 -0.2160 -0.1811 -0.1197 -0.1330 0.0775 0.0973 0.1509 0.1453 0.0952 0.1056 0.1006 0.0945 0.0944 0.1464 0.1271 0.1549 0.1947 0.2042 0.1504 0.1579 0.1468 0.1464 0.2468
va: 1.2509 1.2098 2.0132 1.9627 2.0935 3.3685 3.5021 3.0343 4.0022 3.8922 3.8481 3.9765 3.4811 3.9625 3.9646 3.8870 4.1291 3.9738 3.8042 3.9816 3.9497 3.7207 4.0335 3.9796 3.9536 3.9638 3.8505 0.9970 1.0040 1.0154 1.0014 0.9929 1.0089 0.9967 1.0105 1.0269 1.0279 1.0005 0.9814 0.9732 1.0034 0.9964 1.0021 1.0033 0.9776
dispersion: -0.026472317 hartree
energy: -2045.163010779307 hartree
dipole: 22.14467 -15.81620 6.32847 14.38164 -11.58955 2.79209 -10.16199 11.91428 1.75228
magnitude: 7.13553 au
magnitude: 18.13708 debye
