program: Orca
programVersion: 5.0.2
elementType: Cl Cl O O O N N N C C C C C C C C C C C C C C C C C C C H H H H H H H H H H H H H H H H H H
charge: 1
multiplicity: 1
keywords: wb97x-d3
keywords: def2-TZVPP
keywords: def2/J RIJCOSX
keywords: DEFGRID2
keywords: scfconv7
keywords: smallprint printgap noloewdin
keywords: NOSOSCF
formula: C19H18Cl2N3O3
InChI: InChI=1/C19H18Cl2N3O3/c1-13-9-25-19(27-13,10-24-12-22-11-23-24)17-7-6-16(8-18(17)21)26-15-4-2-14(20)3-5-15/h2-8,11-13,23H,9-10H2,1H3
45 atoms
Cl 0.764048 -1.832933 0.247911
Cl -7.142427 -2.273271 -1.118731
O  2.876036 -0.065187 -0.865042
O  3.12787 2.00009 -0.083331
O  -3.063928 1.421684 0.889206
N  4.588675 -0.085397 1.25279
N  5.564144 0.823071 1.161574
N  6.408937 -1.096078 0.58261
C  2.545307 0.763881 0.205627
C  3.026483 0.738528 -2.040768
C  3.196751 0.236606 1.486412
C  3.050275 2.170456 -1.490987
C  1.03756 0.885213 0.401014
C  1.914566 0.497197 -3.035143
C  0.174914 -0.209104 0.405705
C  0.463004 2.138909 0.593305
C  -1.195258 -0.070122 0.560266
C  -0.900746 2.310227 0.736968
C  -1.731984 1.200533 0.710551
C  5.126672 -1.233902 0.877711
C  6.651595 0.191062 0.76662
C  -3.980989 0.521462 0.39908
C  -4.933465 0.026221 1.273689
C  -3.994464 0.166753 -0.942605
C  -5.915664 -0.833115 0.804894
C  -4.968425 -0.700121 -1.410204
C  -5.921854 -1.19333 -0.532274
H  3.98772 0.473464 -2.485918
H  2.725884 -0.678785 1.835761
H  3.124298 0.975648 2.283673
H  3.918931 2.739143 -1.818482
H  2.146392 2.723216 -1.766739
H  2.070537 1.122877 -3.915082
H  0.939396 0.746858 -2.61442
H  1.896313 -0.540182 -3.368429
H  1.094065 3.016032 0.61814
H  -1.825828 -0.949229 0.566507
H  -1.316444 3.300257 0.868813
H  4.557008 -2.148253 0.844907
H  7.594094 0.695245 0.628287
H  -4.916493 0.310476 2.317469
H  -3.257305 0.562883 -1.629126
H  -6.661531 -1.219621 1.485504
H  -4.982802 -0.978081 -2.454881
H  5.410028 1.804552 1.374378
elementType: Cl O N C H
totalener: -2045.13337626 hartree
nucrepener: 2754.38548671 hartree
electener: -4799.51886297 hartree
oneelecener: -8255.00806496 hartree
twoeener: 3455.48920198 hartree
cpcmener: -0.11696235 hartree
kineticenergy: 2039.02482291 hartree
xcener: -150.072126848998 hartree
chargesum: 1.0000000
charge: -0.076026 -0.098070 -0.388998 -0.395248 -0.328043 0.104544 -0.027231 -0.365784 0.597313 0.213604 -0.095705 -0.035565 -0.176838 -0.306330 -0.012986 -0.098739 -0.156917 -0.265505 0.280810 0.161713 0.193308 0.269878 -0.237870 -0.189210 -0.114481 -0.129989 0.072031 0.091591 0.151103 0.163109 0.113792 0.103762 0.105643 0.088046 0.093384 0.151351 0.132653 0.149924 0.194789 0.204420 0.151448 0.165424 0.147524 0.147757 0.250611
qa: -0.0760 -0.0981 -0.3890 -0.3952 -0.3280 0.1045 -0.0272 -0.3658 0.5973 0.2136 -0.0957 -0.0356 -0.1768 -0.3063 -0.0130 -0.0987 -0.1569 -0.2655 0.2808 0.1617 0.1933 0.2699 -0.2379 -0.1892 -0.1145 -0.1300 0.0720 0.0916 0.1511 0.1631 0.1138 0.1038 0.1056 0.0880 0.0934 0.1514 0.1327 0.1499 0.1948 0.2044 0.1514 0.1654 0.1475 0.1478 0.2506
va: 1.2462 1.2046 1.9715 1.9738 2.0802 3.3725 3.5201 3.0382 3.8531 3.8143 3.7199 3.9288 3.5792 3.9861 4.0047 3.9025 3.9595 4.0617 3.7845 4.0065 3.9480 3.7010 4.0432 3.9701 3.9477 3.9596 3.8388 1.0012 1.0134 1.0041 1.0020 0.9981 1.0070 0.9957 1.0074 1.0166 1.0244 1.0080 0.9853 0.9730 1.0041 0.9922 1.0017 1.0029 0.9734
dispersion: -0.025683255 hartree
energy: -2045.159059515440 hartree
dipole: 24.41847 -15.96675 8.45171 16.54770 -13.90070 2.64700 -5.60198 7.18499 1.58301
magnitude: 8.99689 au
magnitude: 22.86827 debye
