program: Orca
programVersion: 5.0.2
elementType: Cl Cl O O O N N N C C C C C C C C C C C C C C C C C C C H H H H H H H H H H H H H H H H H H
charge: 1
multiplicity: 1
keywords: wb97x-d3
keywords: def2-TZVPP
keywords: def2/J RIJCOSX
keywords: DEFGRID2
keywords: scfconv7
keywords: smallprint printgap noloewdin
keywords: NOSOSCF
formula: C19H18Cl2N3O3
InChI: InChI=1/C19H18Cl2N3O3/c1-13-9-25-19(27-13,10-24-12-22-11-23-24)17-7-6-16(8-18(17)21)26-15-4-2-14(20)3-5-15/h2-8,11-13,23H,9-10H2,1H3
45 atoms
Cl 0.75404 -1.622745 -1.838604
Cl -6.744762 -2.496931 0.808212
O  3.085115 0.156292 -2.357318
O  3.675147 1.646961 -0.775831
O  -2.388494 1.418188 0.725342
N  3.406457 -0.480151 1.213147
N  4.031071 0.47035 1.917044
N  2.497126 -0.386333 3.202494
C  2.948728 0.470289 -1.004483
C  3.549583 1.320031 -3.047548
C  3.599085 -0.680752 -0.208687
C  4.376983 1.990505 -1.966392
C  1.501055 0.687933 -0.578447
C  2.408986 2.167443 -3.574071
C  0.471045 -0.191962 -0.90059
C  1.162995 1.784213 0.214839
C  -0.83693 0.012747 -0.486132
C  -0.126789 2.004786 0.656087
C  -1.132454 1.117679 0.29821
C  2.470803 -0.967675 2.014555
C  3.472899 0.503946 3.111267
C  -3.374761 0.458615 0.720132
C  -3.248286 -0.700368 1.472395
C  -4.526455 0.713819 -0.004739
C  -4.286718 -1.616785 1.495018
C  -5.572362 -0.196411 0.026943
C  -5.441903 -1.356374 0.772632
H  4.171988 0.972327 -3.872802
H  4.667365 -0.733255 -0.419474
H  3.15599 -1.645981 -0.445094
H  5.400074 1.605514 -1.937355
H  4.40931 3.076383 -2.051941
H  1.742964 1.575781 -4.202369
H  2.808346 2.977025 -4.185502
H  1.817856 2.614697 -2.773408
H  1.926255 2.492753 0.501564
H  -1.605487 -0.687362 -0.784131
H  -0.353855 2.866894 1.269093
H  1.800209 -1.752451 1.700835
H  3.803184 1.1774 3.885392
H  -2.349601 -0.893214 2.044545
H  -4.616286 1.621854 -0.586348
H  -4.191978 -2.521256 2.079986
H  -6.475741 0.002209 -0.533169
H  4.798448 1.012003 1.527777
elementType: Cl O N C H
totalener: -2045.13096512 hartree
nucrepener: 2807.68857330 hartree
electener: -4852.81953842 hartree
oneelecener: -8361.01542402 hartree
twoeener: 3508.19588560 hartree
cpcmener: -0.11967971 hartree
kineticenergy: 2038.99403805 hartree
xcener: -150.066783904921 hartree
chargesum: 1.0000000
charge: -0.072957 -0.097364 -0.382870 -0.400045 -0.324565 0.091946 -0.019328 -0.359954 0.509048 0.196298 -0.106137 0.006674 -0.155628 -0.307824 0.027126 -0.106339 -0.159238 -0.263829 0.315799 0.165579 0.192997 0.268914 -0.195746 -0.227814 -0.128796 -0.118360 0.075201 0.099303 0.151253 0.146409 0.095122 0.103277 0.092081 0.103632 0.095964 0.147727 0.128232 0.149545 0.196122 0.204523 0.163998 0.151979 0.148438 0.147895 0.251712
qa: -0.0730 -0.0974 -0.3829 -0.4000 -0.3246 0.0919 -0.0193 -0.3600 0.5090 0.1963 -0.1061 0.0067 -0.1556 -0.3078 0.0271 -0.1063 -0.1592 -0.2638 0.3158 0.1656 0.1930 0.2689 -0.1957 -0.2278 -0.1288 -0.1184 0.0752 0.0993 0.1513 0.1464 0.0951 0.1033 0.0921 0.1036 0.0960 0.1477 0.1282 0.1495 0.1961 0.2045 0.1640 0.1520 0.1484 0.1479 0.2517
va: 1.2517 1.2053 2.0021 1.9612 2.0881 3.3713 3.5097 3.0282 3.9748 3.8896 3.8274 3.9799 3.4878 3.9597 3.9880 3.8391 3.9747 4.0837 3.7643 3.9927 3.9492 3.6955 3.9799 4.0448 3.9586 3.9490 3.8378 0.9967 1.0048 1.0124 1.0015 0.9916 1.0112 1.0085 0.9956 1.0243 1.0288 1.0068 0.9810 0.9734 0.9933 1.0034 1.0026 1.0018 0.9742
dispersion: -0.026930779 hartree
energy: -2045.157895902947 hartree
dipole: 28.24079 -20.15408 8.08671 18.34011 -16.83845 1.50165 -6.60913 8.10459 1.49546
magnitude: 8.35980 au
magnitude: 21.24893 debye
