program: Gaussian 09
title: 000070957
version: EM64L-G09RevD.01
frameworkgroup: C1[X(C7H9NO2)]
method: RPBEPBE
basis: SDD
operation: Freq
keyword: #pfreq=noraman
keyword: PBEPBE/SDD
title: #p freq=noraman PBEPBE/SDD
converged: YES YES NO NO
title: Mulliken charges:
elementType: O O N C C C C C C C H H H H H H H H H
charge: -0.472118 -0.472118 -0.021716 0.079617 0.079617 -0.316827 -0.316827 -0.395559 -0.395559 -0.164403 0.285770 0.285770 0.218774 0.218790 0.218791 0.218773 0.235294 0.356965 0.356965
chargesum: 0.00000
title: Mulliken charges with hydrogens summed into heavy atoms:
elementType: O O N C C C C C C C
charge: -0.115153 -0.115153 -0.021716 0.079617 0.079617 -0.031057 -0.031057 0.042005 0.042005 0.070891
polarizability: 1.19383708e+02 -3.93745047e-07 9.30932060e+01 -1.13537977e-04 -1.76402172e-02 4.44431701e+01
1716.lowfreq: -14.2078 -5.0572 0.0004 0.0007 0.0009 5.7973 55.0362 70.0933 166.8133
frequency: 55.0023 70.0850 166.8133 180.1321 181.6935 236.4966 250.4548 255.1000 342.6825 424.7797 485.4075 537.7151 579.4035 589.0134 722.9320 740.6383 798.0233 884.8845 932.1215 964.1506 994.7246 999.8650 1016.3786 1017.6456 1018.0919 1075.8482 1139.7097 1153.8891 1166.7383 1193.5696 1194.2907 1246.6978 1283.6298 1331.4190 1365.7248 1393.3632 1431.9921 1449.4009 1461.4290 1466.0230 1576.7781 1590.6599 2945.0856 2946.2327 2994.8349 2995.4116 3140.0595 3185.7143 3191.0395 3593.4096 3593.4751
redmass: 4.9033 2.7666 5.0524 2.0378 2.5931 1.1451 1.2848 4.8538 7.2869 3.5156 6.2268 3.1096 4.7723 5.8067 4.6129 3.5756 1.1980 4.1696 1.2989 7.1635 7.9197 1.5290 1.8145 5.6151 1.5347 1.6041 1.2218 1.2008 1.1325 1.0688 1.0734 1.6455 2.2839 4.8781 2.0945 1.4766 2.4425 1.8701 1.0851 1.3493 7.2034 5.7268 1.0550 1.0552 1.1054 1.1055 1.0899 1.0926 1.0974 1.0667 1.0667
irintensity: 10.3164 0.0000 0.9462 175.0193 0.0002 0.0079 209.5134 28.8010 0.4577 0.0006 0.2232 0.0009 28.5381 0.0611 3.5107 1.1453 70.0633 6.6311 0.0003 9.1210 18.4708 0.0064 0.3548 149.0836 3.9786 8.5843 49.6674 52.6938 5.6402 0.0003 0.4671 19.9737 0.2480 0.0003 10.6004 7.1534 1.4451 87.4091 11.6238 4.6465 43.1218 39.3503 1.4830 79.1191 0.0013 81.0509 14.8603 0.1880 3.5643 10.7335 1.0537
temp: 298.150 k
press: 1.00000 atm
elementType: 8 8 7 6 6 6 6 6 6 6 1 1 1 1 1 1 1 1 1
symmnumber: 1
zpe: 392080.0 jmol-1
zpe.correction: 0.149335 hartree
zpe.thermalcorrener: 0.159290 hartree
zpe.thermalcorrenthalpy: 0.160235 hartree
zpe.thermalcorrgfe: 0.113669 hartree
zpe.sumelectzpe: -476.561820 hartree
zpe.sumelectthermal: -476.551865 hartree
zpe.sumelectthermalent: -476.550921 hartree
zpe.sumelectthermalfe: -476.597487 hartree
dipole: 0.0000 -1.8097 -0.0007
dipole: 1.8097
quadrupole: -42.0317 -53.0989 -61.1902
quadrupole: 0.0000 -0.0005 0.0165
quadrupole: 10.0752 -0.9920 -9.0832 0.0000 -0.0005 0.0165
hfenergy: -476.7111554 hartree
pointgroup: C01 [X(C7H9N1O2)]
dipole: -0.0000053 0.7003471 0.1282485 debye
dipolederiv: -0.7922106 -0.1953285 -0.0352291 -0.2951313 -0.2673258 0.0602302 -0.053 0.0596844 -0.5822846 -0.7922197 0.195319 0.0352281 0.2951208 -0.2673279 0.0602642 0.0530042 0.0597086 -0.5822741 -0.6598707 -0.0000003 -0.000011 -0.000001 -0.3518709 -0.0213831 -0.0000073 -0.0217289 -0.2388319 0.454678 -0.1509012 -0.027624 -0.3898249 0.2924725 0.0520681 -0.0708468 0.0519736 0.0167696 0.454669 0.1509003 0.027642 0.3898232 0.2924783 0.0520816 0.0708697 0.0519891 0.0167752 -0.1882908 0.0770208 0.0141257 0.2932674 -0.2590241 -0.0253154 0.0532732 -0.025292 -0.1247336 -0.1882845 -0.0770197 -0.0141266 -0.2932657 -0.2590279 -0.025327 -0.053275 -0.0252993 -0.124737 0.6009835 0.1798351 0.0317521 0.346505 0.1854837 -0.0370509 0.0615543 -0.0364196 0.3783359 0.6009921 -0.1798305 -0.0317373 -0.3464993 0.185482 -0.037075 -0.0615457 -0.0364373 0.3783282 0.2193788 -0.0000009 0.0000045 -0.0000013 0.2244577 0.0644177 0.0000044 0.0644956 -0.1162255 0.0403792 -0.072873 -0.0133448 -0.1001206 0.0953513 -0.0137203 -0.0183485 -0.0137116 0.1681552 0.040376 0.0728729 0.0133406 0.1001207 0.0953525 -0.013715 0.018343 -0.0137071 0.1681569 -0.0498405 -0.0097336 -0.0033328 -0.0350803 0.0028108 -0.0925066 0.0101395 -0.1252479 -0.1192752 -0.0502623 -0.0094139 -0.0002768 -0.0289257 -0.0836817 0.1061054 -0.0216281 0.1388094 -0.0331476 -0.0502624 0.0094081 0.0002754 0.028921 -0.0836832 0.106108 0.0216246 0.1388107 -0.0331477 -0.0498418 0.0097387 0.0033371 0.0350851 0.0028125 -0.0925039 -0.0101365 -0.125247 -0.1192737 0.081379 0.0000021 -0.0000011 0.0000019 -0.1115355 -0.0463231 0.0000001 -0.0463695 0.13333 0.164121 0.1103338 0.0207562 0.1837016 0.1533869 -0.0481665 0.0340503 -0.0479973 0.4070434 0.1641268 -0.1103294 -0.020778 -0.1836965 0.1533888 -0.0481883 -0.0340756 -0.0480138 0.4070364 unknown
polarizability: 119.3837078|-0.0000543|91.5277128|0.0016069|8.5855018|46.0086633 unknown
InChI: InChI=1S/C7H9NO2/c9-4-6-2-1-3-7(5-10)8-6/h1-3,9-10H,4-5H2
charge 0 multiplicity 1
19 atoms
O  -3.595453 0.171325 0.095277
O  3.595388 0.171362 0.095429
N  -0.000039 0.895212 0.222683
C  -1.172211 0.206076 0.097293
C  1.172145 0.206092 0.097327
C  -1.221534 -1.184035 -0.156118
C  1.221493 -1.184021 -0.156072
C  -2.427037 1.044998 0.250788
C  2.426957 1.045024 0.250885
C  -0.000014 -1.88324 -0.28389
H  -2.193325 -1.673869 -0.24535
H  2.193293 -1.673845 -0.245262
H  -2.409757 1.529575 1.250109
H  -2.412899 1.848042 -0.516489
H  2.412847 1.848067 -0.516393
H  2.409626 1.529602 1.250204
H  -0.000004 -2.960962 -0.48097
H  -4.421252 0.705231 0.194907
H  4.421177 0.705267 0.195144
