program: Orca
programVersion: 5.0.2
elementType: Cl Cl O O O N N N C C C C C C C C C C C C C C C C C C C H H H H H H H H H H H H H H H H H H
charge: 1
multiplicity: 1
keywords: wb97x-d3
keywords: def2-TZVPP
keywords: def2/J RIJCOSX
keywords: DEFGRID2
keywords: scfconv7
keywords: smallprint printgap noloewdin
keywords: NOSOSCF
formula: C19H18Cl2N3O3
InChI: InChI=1/C19H18Cl2N3O3/c1-13-9-25-19(27-13,10-24-12-22-11-23-24)17-7-6-16(8-18(17)21)26-15-4-2-14(20)3-5-15/h2-8,11-13,23H,9-10H2,1H3
45 atoms
Cl 2.424333 -2.432752 -1.781776
Cl -6.804309 0.900286 2.226811
O  3.537065 0.324138 -2.159949
O  2.860471 1.940026 -0.743111
O  -2.329784 -1.620208 -0.58744
N  3.215698 0.095134 1.462371
N  3.147888 1.257905 2.119802
N  1.898585 -0.166226 3.191153
C  2.917958 0.552554 -0.929062
C  3.516088 1.545399 -2.906826
C  3.829412 -0.054544 0.157905
C  3.592018 2.568719 -1.790458
C  1.509274 -0.023472 -0.853879
C  2.279547 1.668911 -3.773809
C  1.207822 -1.339676 -1.205215
C  0.456035 0.750907 -0.376964
C  -0.07146 -1.854054 -1.099237
C  -0.836433 0.266294 -0.265047
C  -1.097999 -1.045725 -0.630113
C  2.432602 -0.741606 2.126559
C  2.360032 1.074052 3.160716
C  -3.3502 -0.989026 0.087683
C  -4.433014 -0.527491 -0.640261
C  -3.315421 -0.871581 1.469263
C  -5.505442 0.053106 0.020094
C  -4.381023 -0.283254 2.130513
C  -5.468112 0.172801 1.399603
H  4.413622 1.554829 -3.525968
H  4.799961 0.441479 0.163774
H  3.991736 -1.120348 0.015694
H  4.623809 2.760154 -1.482642
H  3.111836 3.51669 -2.031018
H  2.368934 2.548338 -4.412054
H  1.367608 1.776662 -3.184848
H  2.168811 0.799428 -4.421892
H  0.633863 1.776617 -0.088938
H  -0.278039 -2.877813 -1.382057
H  -1.615089 0.922711 0.098075
H  2.288228 -1.762835 1.81059
H  2.151561 1.856017 3.872397
H  -4.448299 -0.624139 -1.717851
H  -2.466937 -1.237599 2.033324
H  -6.355385 0.410928 -0.544459
H  -4.360711 -0.189786 3.207577
H  3.662977 2.078896 1.813995
elementType: Cl O N C H
totalener: -2045.13130765 hartree
nucrepener: 2802.20992044 hartree
electener: -4847.34122809 hartree
oneelecener: -8349.94685925 hartree
twoeener: 3502.60563116 hartree
cpcmener: -0.11975281 hartree
kineticenergy: 2039.01065992 hartree
xcener: -150.069609905160 hartree
chargesum: 1.0000000
charge: -0.074960 -0.096730 -0.384306 -0.404424 -0.326953 0.097443 -0.020091 -0.361153 0.512624 0.197848 -0.112332 0.005469 -0.145905 -0.305861 0.061160 -0.140538 -0.221773 -0.199356 0.306146 0.160432 0.194539 0.256175 -0.210966 -0.185596 -0.127419 -0.135917 0.083365 0.098585 0.150267 0.148338 0.095325 0.105207 0.103097 0.095467 0.091824 0.146503 0.125664 0.155038 0.197277 0.204423 0.152459 0.160837 0.147804 0.148883 0.252082
qa: -0.0750 -0.0967 -0.3843 -0.4044 -0.3270 0.0974 -0.0201 -0.3612 0.5126 0.1978 -0.1123 0.0055 -0.1459 -0.3059 0.0612 -0.1405 -0.2218 -0.1994 0.3061 0.1604 0.1945 0.2562 -0.2110 -0.1856 -0.1274 -0.1359 0.0834 0.0986 0.1503 0.1483 0.0953 0.1052 0.1031 0.0955 0.0918 0.1465 0.1257 0.1550 0.1973 0.2044 0.1525 0.1608 0.1478 0.1489 0.2521
va: 1.2460 1.2058 2.0011 1.9612 2.0840 3.3637 3.5137 3.0279 3.9760 3.8886 3.8335 3.9783 3.4946 3.9609 3.9413 3.8817 4.1408 3.9791 3.7807 3.9952 3.9479 3.7035 4.0348 3.9836 3.9554 3.9606 3.8317 0.9972 1.0060 1.0133 1.0021 0.9918 1.0084 0.9953 1.0114 1.0279 1.0289 1.0009 0.9802 0.9734 1.0020 0.9959 1.0020 1.0022 0.9726
dispersion: -0.026774489 hartree
energy: -2045.158082140026 hartree
dipole: 21.42267 -14.88840 6.53428 14.04823 -11.13858 2.90965 -9.70955 11.56527 1.85571
magnitude: 7.38962 au
magnitude: 18.78293 debye
