program: Orca
programVersion: 5.0.2
elementType: Cl Cl O O O N N N C C C C C C C C C C C C C C C C C C C H H H H H H H H H H H H H H H H H H
charge: 1
multiplicity: 1
keywords: wb97x-d3
keywords: def2-TZVPP
keywords: def2/J RIJCOSX
keywords: DEFGRID2
keywords: scfconv7
keywords: smallprint printgap noloewdin
keywords: NOSOSCF
formula: C19H18Cl2N3O3
InChI: InChI=1/C19H18Cl2N3O3/c1-13-9-25-19(27-13,10-24-12-22-11-23-24)17-7-6-16(8-18(17)21)26-15-4-2-14(20)3-5-15/h2-8,11-13,22H,9-10H2,1H3
45 atoms
Cl -0.362178 0.033337 -1.896089
Cl 7.396609 0.940433 -1.192899
O  -2.90739 -1.023479 -0.861176
O  -3.491434 -0.710574 1.249183
O  2.745214 -0.456047 2.073938
N  -4.328844 1.310324 -0.554476
N  -5.346741 1.718079 0.214456
N  -6.058197 1.115173 -1.752842
C  -2.623506 -0.251704 0.266212
C  -3.273881 -2.332334 -0.415469
C  -2.976211 1.209504 -0.032552
C  -3.5745 -2.11445 1.0805
C  -1.166905 -0.323133 0.692727
C  -2.187858 -3.351556 -0.679734
C  -0.102604 -0.203581 -0.197565
C  -0.849608 -0.463036 2.043508
C  1.216559 -0.245333 0.221983
C  0.45405 -0.506196 2.489733
C  1.497981 -0.397306 1.575387
C  -4.739518 0.932856 -1.743017
C  -6.398478 1.600238 -0.525062
C  3.817088 -0.120047 1.278992
C  4.049965 1.205242 0.945559
C  4.678498 -1.118878 0.861705
C  5.155546 1.532579 0.178997
C  5.789935 -0.790556 0.101039
C  6.020484 0.532623 -0.241806
H  -4.179167 -2.60991 -0.962852
H  -2.288408 1.632858 -0.762428
H  -2.934598 1.80451 0.876689
H  -4.572552 -2.437571 1.374736
H  -2.844219 -2.631904 1.711445
H  -1.953704 -3.413832 -1.741287
H  -2.521336 -4.338666 -0.356606
H  -1.271407 -3.113325 -0.139621
H  -1.647736 -0.53412 2.770003
H  2.010124 -0.157845 -0.507279
H  0.673067 -0.618311 3.542825
H  -4.129217 0.561753 -2.549406
H  -7.403137 1.848814 -0.225844
H  3.381874 1.983743 1.290777
H  4.492434 -2.147736 1.139804
H  5.348932 2.563691 -0.081659
H  6.473212 -1.562881 -0.22287
H  -6.675193 0.931459 -2.531362
totalener: -2045.05154851 hartree
nucrepener: 2752.43061201 hartree
electener: -4797.48216052 hartree
oneelecener: -8252.67102930 hartree
twoeener: 3455.18886879 hartree
kineticenergy: 2039.09348412 hartree
xcener: -150.081460294619 hartree
chargesum: 1.0000000
charge: -0.056929 -0.048723 -0.381462 -0.336926 -0.278734 0.128472 -0.218688 -0.126179 0.618820 0.170756 -0.167191 -0.055993 -0.246615 -0.276666 -0.045771 -0.077117 -0.132758 -0.223080 0.260350 0.158610 0.142156 0.207266 -0.166154 -0.172194 -0.109246 -0.102811 0.065374 0.079708 0.171733 0.148966 0.107510 0.105410 0.099138 0.106363 0.089948 0.150937 0.129532 0.141655 0.210524 0.190646 0.135066 0.133984 0.130449 0.132116 0.207749
qa: -0.0569 -0.0487 -0.3815 -0.3369 -0.2787 0.1285 -0.2187 -0.1262 0.6188 0.1708 -0.1672 -0.0560 -0.2466 -0.2767 -0.0458 -0.0771 -0.1328 -0.2231 0.2604 0.1586 0.1422 0.2073 -0.1662 -0.1722 -0.1092 -0.1028 0.0654 0.0797 0.1717 0.1490 0.1075 0.1054 0.0991 0.1064 0.0899 0.1509 0.1295 0.1417 0.2105 0.1906 0.1351 0.1340 0.1304 0.1321 0.2077
va: 1.2734 1.2552 1.9559 2.0318 2.1422 3.4518 2.9154 3.5469 3.8384 3.8269 3.7065 3.9532 3.5462 3.9967 4.0807 3.9106 3.9316 4.0865 3.9005 3.9320 3.9242 3.8095 4.0054 4.0376 3.9787 3.9709 3.9826 0.9997 1.0093 1.0216 1.0022 0.9976 1.0106 1.0082 0.9975 1.0143 1.0273 1.0135 0.9890 0.9804 1.0028 1.0086 1.0097 1.0086 0.9923
dispersion: -0.025392869 hartree
energy: -2045.076941380270 hartree
dipole: -28.65929 20.65517 -8.00413 -12.19215 12.74825 0.55609 6.70003 -8.46337 -1.76334
magnitude: 8.21490 au
magnitude: 20.88063 debye
