program: Orca
programVersion: 5.0.2
elementType: Cl Cl O O O N N N C C C C C C C C C C C C C C C C C C C H H H H H H H H H H H H H H H H H H
charge: 1
multiplicity: 1
keywords: wb97x-d3
keywords: def2-TZVPP
keywords: def2/J RIJCOSX
keywords: DEFGRID2
keywords: scfconv7
keywords: smallprint printgap noloewdin
keywords: NOSOSCF
formula: C19H18Cl2N3O3
InChI: InChI=1/C19H18Cl2N3O3/c1-13-9-25-19(27-13,10-24-12-22-11-23-24)17-7-6-16(8-18(17)21)26-15-4-2-14(20)3-5-15/h2-8,11-13,22H,9-10H2,1H3
45 atoms
Cl -2.528978 0.820374 2.910756
Cl 6.868649 -0.07151 -1.924667
O  -3.002165 -1.824226 -0.713313
O  -3.60674 -1.566389 1.42485
O  2.186992 1.090176 1.388279
N  -3.422116 0.970757 -1.154161
N  -2.86309 2.173787 -0.968081
N  -2.639808 1.533096 -3.035395
C  -3.025266 -0.912483 0.354392
C  -3.220573 -3.149801 -0.201468
C  -3.98075 0.229941 -0.032662
C  -3.218232 -2.919557 1.307854
C  -1.620791 -0.397387 0.639633
C  -2.163837 -4.110689 -0.690569
C  -1.319558 0.392506 1.753908
C  -0.576025 -0.667966 -0.236948
C  -0.044339 0.869501 1.982391
C  0.710889 -0.19517 -0.037111
C  0.980392 0.576408 1.086785
C  -3.288894 0.563346 -2.395059
C  -2.390405 2.511325 -2.121328
C  3.27003 0.794552 0.593653
C  3.722427 1.746608 -0.303082
C  3.920827 -0.42104 0.7276
C  4.83911 1.480905 -1.079497
C  5.033728 -0.6899 -0.052039
C  5.485601 0.261005 -0.95568
H  -4.209393 -3.479762 -0.537065
H  -4.114198 0.940802 0.77825
H  -4.952266 -0.172045 -0.318942
H  -3.937974 -3.53595 1.84352
H  -2.223107 -3.084314 1.738127
H  -2.360747 -5.107743 -0.29532
H  -1.167925 -3.81107 -0.363186
H  -2.164418 -4.189972 -1.776987
H  -0.761398 -1.284914 -1.105135
H  0.1664 1.469151 2.857589
H  1.487995 -0.443517 -0.746469
H  -3.632277 -0.370914 -2.806564
H  -1.875938 3.432513 -2.338288
H  3.219152 2.701242 -0.380415
H  3.572621 -1.151515 1.446331
H  5.207678 2.222372 -1.774393
H  5.553276 -1.632305 0.04963
H  -2.388704 1.533753 -4.013985
totalener: -2045.04900414 hartree
nucrepener: 2792.27995648 hartree
electener: -4837.32896062 hartree
oneelecener: -8331.63465194 hartree
twoeener: 3494.30569133 hartree
kineticenergy: 2039.09077814 hartree
xcener: -150.080013837510 hartree
chargesum: 1.0000000
charge: -0.028502 -0.045859 -0.408701 -0.304756 -0.279984 0.130901 -0.217950 -0.115601 0.590383 0.086036 -0.153408 0.019360 -0.198838 -0.261467 0.033120 -0.182286 -0.183782 -0.194624 0.263378 0.155497 0.148010 0.218863 -0.175278 -0.167919 -0.110186 -0.109962 0.065610 0.083743 0.161151 0.140634 0.116554 0.085865 0.109698 0.082717 0.094438 0.146097 0.131886 0.139072 0.206594 0.189810 0.129489 0.137467 0.130932 0.134065 0.207734
qa: -0.0285 -0.0459 -0.4087 -0.3048 -0.2800 0.1309 -0.2180 -0.1156 0.5904 0.0860 -0.1534 0.0194 -0.1988 -0.2615 0.0331 -0.1823 -0.1838 -0.1946 0.2634 0.1555 0.1480 0.2189 -0.1753 -0.1679 -0.1102 -0.1100 0.0656 0.0837 0.1612 0.1406 0.1166 0.0859 0.1097 0.0827 0.0944 0.1461 0.1319 0.1391 0.2066 0.1898 0.1295 0.1375 0.1309 0.1341 0.2077
va: 1.3027 1.2587 1.9492 2.0632 2.1385 3.4465 2.8950 3.5524 3.8512 3.9475 3.8027 3.9428 3.5352 3.9521 4.0775 3.8832 4.0972 4.0303 3.9035 3.9378 3.9174 3.7952 4.0320 4.0048 3.9725 3.9695 3.9843 1.0031 1.0298 1.0183 0.9969 1.0055 1.0094 1.0043 1.0058 1.0178 1.0251 1.0113 0.9940 0.9809 1.0084 1.0039 1.0093 1.0083 0.9924
dispersion: -0.025840211 hartree
energy: -2045.074844348485 hartree
dipole: -18.94676 14.67734 -4.26942 -15.66398 16.04136 0.37737 -8.32629 4.44746 -3.87883
magnitude: 5.78063 au
magnitude: 14.69319 debye
