program: Orca
programVersion: 5.0.2
elementType: Cl Cl O O O N N N C C C C C C C C C C C C C C C C C C C H H H H H H H H H H H H H H H H H H
charge: 1
multiplicity: 1
keywords: wb97x-d3
keywords: def2-TZVPP
keywords: def2/J RIJCOSX
keywords: DEFGRID2
keywords: scfconv7
keywords: smallprint printgap noloewdin
keywords: NOSOSCF
formula: C19H18Cl2N3O3
InChI: InChI=1/C19H18Cl2N3O3/c1-13-9-25-19(27-13,10-24-12-22-11-23-24)17-7-6-16(8-18(17)21)26-15-4-2-14(20)3-5-15/h2-8,11-13,22H,9-10H2,1H3
45 atoms
Cl -2.483061 0.393974 3.032242
Cl 7.090647 0.046436 -1.556306
O  -2.995119 -1.640572 -0.955873
O  -3.588303 -1.69197 1.207181
O  2.177147 1.038943 1.462341
N  -3.472218 1.157632 -1.037001
N  -3.94923 1.050036 -2.284934
N  -2.316338 2.487638 -2.206847
C  -3.016657 -0.902061 0.224648
C  -3.361652 -2.998066 -0.670711
C  -3.96698 0.301506 0.02908
C  -3.30238 -3.031191 0.851372
C  -1.608491 -0.432377 0.575517
C  -2.429823 -3.962495 -1.362164
C  -1.296028 0.178467 1.794578
C  -0.576469 -0.54221 -0.3529
C  -0.025361 0.650407 2.066152
C  0.70442 -0.072905 -0.108512
C  0.984736 0.526777 1.114848
C  -2.478705 2.015432 -0.973018
C  -3.241445 1.866639 -2.991145
C  3.300674 0.773255 0.713068
C  3.823492 -0.508989 0.648789
C  3.93421 1.830368 0.084576
C  4.990951 -0.734212 -0.061048
C  5.108369 1.606695 -0.616827
C  5.630432 0.324827 -0.689962
H  -4.38855 -3.156623 -1.017623
H  -4.056322 0.890128 0.940183
H  -4.955062 -0.040522 -0.270834
H  -4.050668 -3.67845 1.305246
H  -2.310509 -3.331684 1.210235
H  -1.399481 -3.827271 -1.031724
H  -2.466824 -3.844156 -2.444029
H  -2.723829 -4.988267 -1.137954
H  -0.777796 -1.016742 -1.30331
H  0.196455 1.104327 3.022873
H  1.470478 -0.190018 -0.862865
H  -1.914269 2.288899 -0.095651
H  -3.361551 2.042334 -4.0472
H  3.336826 -1.328803 1.161509
H  3.528286 2.830209 0.161925
H  5.411175 -1.728816 -0.111319
H  5.61804 2.428968 -1.098893
H  -1.635201 3.176448 -2.492852
totalener: -2045.04819321 hartree
nucrepener: 2778.80267277 hartree
electener: -4823.85086599 hartree
oneelecener: -8304.09621742 hartree
twoeener: 3480.24535143 hartree
kineticenergy: 2039.08415305 hartree
xcener: -150.079639935131 hartree
chargesum: 1.0000000
charge: -0.016699 -0.042157 -0.374648 -0.312322 -0.277834 0.135500 -0.213164 -0.115002 0.596714 0.088259 -0.157983 0.025646 -0.284113 -0.258473 0.022518 -0.132566 -0.214930 -0.192565 0.274374 0.134928 0.146455 0.242644 -0.183462 -0.203511 -0.097307 -0.093128 0.053313 0.081543 0.165712 0.133204 0.116428 0.079875 0.076947 0.101745 0.104090 0.156511 0.137537 0.148604 0.213883 0.189786 0.140390 0.129783 0.134989 0.131985 0.206501
qa: -0.0167 -0.0422 -0.3746 -0.3123 -0.2778 0.1355 -0.2132 -0.1150 0.5967 0.0883 -0.1580 0.0256 -0.2841 -0.2585 0.0225 -0.1326 -0.2149 -0.1926 0.2744 0.1349 0.1465 0.2426 -0.1835 -0.2035 -0.0973 -0.0931 0.0533 0.0815 0.1657 0.1332 0.1164 0.0799 0.0769 0.1017 0.1041 0.1565 0.1375 0.1486 0.2139 0.1898 0.1404 0.1298 0.1350 0.1320 0.2065
va: 1.3142 1.2621 2.0070 2.0554 2.1368 3.4442 2.9227 3.5437 3.9122 3.9565 3.7864 3.9225 3.5266 3.9560 4.0436 3.8593 4.0836 3.9687 3.8703 3.9427 3.9205 3.7593 4.0038 4.0538 3.9640 3.9693 4.0022 1.0010 1.0160 1.0316 0.9969 1.0065 1.0064 1.0047 1.0092 1.0217 1.0256 1.0075 0.9741 0.9809 1.0014 1.0102 1.0080 1.0086 0.9932
dispersion: -0.025665984 hartree
energy: -2045.073859198548 hartree
dipole: -19.18563 15.75598 -3.42966 -12.02448 13.99823 1.97375 -9.50733 7.00283 -2.50450
magnitude: 4.68302 au
magnitude: 11.90330 debye
