program: Gaussian 09
title: 000070967
version: EM64L-G09RevD.01
frameworkgroup: C1[X(C9H10N2)]
method: RPBEPBE
basis: SDD
operation: Freq
keyword: #pfreq=noraman
keyword: PBEPBE/SDD
title: #p freq=noraman PBEPBE/SDD
converged: YES YES NO NO
title: Mulliken charges:
elementType: N N C C C C C C C C C H H H H H H H H H H
charge: -0.152134 -0.043229 0.420005 -0.332846 -0.332858 -0.645503 -0.645478 -0.390222 -0.390172 0.400638 -0.269292 0.243083 0.243074 0.220603 0.238513 0.239033 0.239048 0.220603 0.238492 0.249324 0.249317
chargesum: 0.00000
title: Mulliken charges with hydrogens summed into heavy atoms:
elementType: N N C C C C C C C C C
charge: -0.152134 -0.043229 0.420005 -0.089763 -0.089784 0.052646 0.052665 -0.140898 -0.140855 0.400638 -0.269292
polarizability: 1.98457691e+02 3.19175289e-03 9.99986935e+01 2.33794135e-03 1.31627310e-01 5.35206388e+01
1716.lowfreq: -15.6979 -3.9229 -0.0005 0.0004 0.0004 10.6574 72.9090 81.4381 115.8834
frequency: 72.9033 81.0220 115.8692 129.2380 183.7250 194.9144 245.7073 295.8705 327.2180 417.0397 457.8034 478.2881 480.9421 551.2686 552.3120 643.2561 650.4920 733.3839 778.1282 809.3548 826.3611 939.3550 954.9730 962.6805 995.0545 1057.5811 1107.5571 1112.2811 1130.6847 1164.9424 1192.6325 1223.2054 1256.9072 1316.9962 1367.1919 1367.7376 1431.1499 1447.5705 1459.9109 1466.9142 1478.6383 1490.0799 1502.8194 1528.5481 1545.0117 1631.5124 2163.6433 2946.4128 2953.7608 3014.7358 3017.3728 3100.4869 3110.5424 3146.5613 3147.4706 3172.0928 3176.0896
redmass: 5.1634 2.3107 1.4877 6.9322 2.5417 1.1196 3.5044 3.3475 4.8074 2.9689 4.0397 4.8924 3.2984 2.9336 6.1068 7.4450 4.6709 3.5090 6.2983 1.2512 1.8369 3.1186 1.3693 1.3481 3.0751 1.4975 1.2380 1.3251 1.4728 1.7275 1.4214 2.0222 2.8456 1.4021 4.6533 3.0716 1.3545 2.5053 1.2151 1.0392 1.0450 1.1012 1.1555 2.4475 6.4553 6.0996 12.6207 1.0368 1.0394 1.0995 1.1032 1.0965 1.0945 1.0889 1.0887 1.0946 1.0958
irintensity: 0.0115 0.0001 5.1645 2.1539 4.6714 0.0040 0.5503 2.3677 0.3664 0.0021 2.7838 1.0239 0.1657 21.4717 2.3474 0.1908 2.0731 0.0028 3.8291 0.0003 94.1632 18.9718 2.0069 0.0007 0.0003 26.6076 0.0413 1.0354 2.9835 10.7651 48.3644 0.7994 28.0281 3.2071 0.6827 116.2445 6.9540 0.0053 20.9620 0.0056 23.7518 1.0719 18.6686 225.1648 3.9590 329.9825 142.1909 95.8596 83.1208 0.0088 81.0218 4.2032 39.1016 1.4434 8.8523 20.0725 4.9099
temp: 298.150 k
press: 1.00000 atm
elementType: 7 7 6 6 6 6 6 6 6 6 6 1 1 1 1 1 1 1 1 1 1
symmnumber: 1
zpe: 443253.5 jmol-1
zpe.correction: 0.168826 hartree
zpe.thermalcorrener: 0.179488 hartree
zpe.thermalcorrenthalpy: 0.180432 hartree
zpe.thermalcorrgfe: 0.132473 hartree
zpe.sumelectzpe: -457.645986 hartree
zpe.sumelectthermal: -457.635325 hartree
zpe.sumelectthermalent: -457.634381 hartree
zpe.sumelectthermalfe: -457.682340 hartree
dipole: 8.3618 0.0003 0.0012
dipole: 8.3618
quadrupole: -81.1927 -56.2367 -68.7844
quadrupole: -0.0021 0.0006 0.0128
quadrupole: -12.4548 12.5012 -0.0464 -0.0021 0.0006 0.0128
hfenergy: -457.8148125 hartree
pointgroup: C01 [X(C9H10N2)]
dipole: 3.2897785 -0.0000758 0.0004091 debye
dipolederiv: -1.8511302 -0.0000186 -0.0004426 -0.000003 -0.5073805 -0.013998 -0.0020736 -0.0074118 -0.2882019 -0.8423943 -0.0001169 -0.000356 0.0001336 -0.245092 0.0012519 -0.0000673 0.0012078 -0.2683911 1.821567 0.0000627 0.0006656 0.0000679 -0.0597064 -0.0078216 0.0010833 -0.0094309 0.1407704 -0.6246128 -0.0318859 -0.0012419 0.4772161 -0.001153 0.0127821 0.0235379 0.0133193 -0.231094 -0.6245498 0.0318586 0.0010423 -0.4772716 -0.001144 0.0125132 -0.0237166 0.0132406 -0.2311161 0.3236148 0.161395 0.008431 0.4627114 0.4505618 0.0127327 0.0222881 0.0127828 0.2521998 0.3237659 -0.161486 -0.0085108 -0.4627761 0.4504395 0.012978 -0.0218445 0.013174 0.2522482 0.4716468 0.1249834 0.0065177 0.2082943 0.1758379 0.0164619 0.0113104 0.0165203 -0.1306307 0.4716967 -0.1249864 -0.0061059 -0.2082302 0.1758388 0.0163215 -0.0110075 0.016421 -0.1306457 -0.678728 0.0000022 -0.0002013 -0.000103 -0.1119002 -0.008959 -0.0002472 -0.0098858 0.062175 1.0420075 0.0001029 0.0004585 -0.0000606 -0.0864583 -0.0058228 0.000304 -0.0055623 0.021124 0.0230739 -0.0888467 -0.0051761 -0.0861384 -0.0403954 -0.0114111 -0.0054418 -0.0119035 0.1659871 0.0230466 0.0888643 0.0050708 0.0861552 -0.0404027 -0.0113631 0.0053493 -0.0117788 0.166001 -0.1664006 0.0059809 0.0036478 0.0971205 0.0896211 -0.0035156 0.0075647 -0.0030576 0.1184147 0.0879156 0.0446655 0.0695995 -0.1284587 -0.0599943 -0.0891935 -0.0313916 -0.1239024 -0.0959444 0.0887852 0.0568526 -0.0694482 -0.1243887 -0.0799411 0.0900065 0.0139596 0.1218022 -0.070368 0.0888892 -0.0570618 0.0695221 0.1240336 -0.0800545 0.0901152 -0.0135704 0.1216284 -0.0699851 -0.1663594 -0.0060117 -0.0039587 -0.0971522 0.0896091 -0.0037353 -0.0078643 -0.0032001 0.1183852 0.0877369 -0.0443575 -0.069436 0.1288505 -0.0598599 -0.0890644 0.0318937 -0.1240371 -0.0963275 0.050207 0.0782954 0.0041738 0.0689914 -0.029207 -0.0101202 0.0042085 -0.0099317 0.1577017 0.0502221 -0.0782918 -0.0042516 -0.0689922 -0.0292185 -0.0101584 -0.0042748 -0.0099945 0.1576972 unknown
polarizability: 198.4576814|-0.0037834|99.8678498|0.0370353|2.4660822|53.6514919 unknown
InChI: InChI=1S/C9H10N2/c1-11(2)9-5-3-8(7-10)4-6-9/h3-6H,1-2H3
charge 0 multiplicity 1
21 atoms
N  2.549538 -0.000153 0.001683
N  -4.35169 0.000074 -0.000469
C  1.156142 -0.000235 0.000958
C  0.413042 1.225423 0.066451
C  0.413129 -1.225928 -0.06509
C  3.287576 1.269941 0.05799
C  3.287887 -1.270037 -0.055478
C  -0.988633 1.220592 0.065485
C  -0.988545 -1.221139 -0.065147
C  -1.718737 -0.000284 -0.000104
C  -3.153366 -0.000282 -0.000618
H  0.933919 2.18476 0.120044
H  0.934064 -2.185254 -0.118253
H  4.369104 1.065559 0.032273
H  3.069396 1.832238 0.988352
H  3.044626 1.923838 -0.803542
H  3.044253 -1.924924 0.805086
H  4.369342 -1.065462 -0.028396
H  3.070737 -1.831366 -0.986685
H  -1.533571 2.169041 0.116493
H  -1.533415 -2.169604 -0.116533
