program: Orca
programVersion: 5.0.2
elementType: Cl Cl O O O N N N C C C C C C C C C C C C C C C C C C C H H H H H H H H H H H H H H H H H H
charge: 1
multiplicity: 1
keywords: wb97x-d3
keywords: def2-TZVPP
keywords: def2/J RIJCOSX
keywords: DEFGRID2
keywords: scfconv7
keywords: smallprint printgap noloewdin
keywords: NOSOSCF
formula: C19H18Cl2N3O3
InChI: InChI=1/C19H18Cl2N3O3/c1-13-9-25-19(27-13,10-24-12-22-11-23-24)17-7-6-16(8-18(17)21)26-15-4-2-14(20)3-5-15/h2-8,11-13,22H,9-10H2,1H3
45 atoms
Cl -1.971298 1.687428 2.257789
Cl 7.71516 -0.558191 -1.370366
O  -2.601581 -1.243946 -1.100103
O  -3.405144 -0.427268 0.79845
O  2.820125 0.556294 1.636075
N  -4.32439 0.997492 -1.354134
N  -5.273821 1.679515 -0.700339
N  -6.158358 0.373404 -2.199937
C  -2.492316 -0.162834 -0.210793
C  -3.053414 -2.391099 -0.362557
C  -2.928165 1.101293 -0.956989
C  -3.297357 -1.814617 1.037239
C  -1.067407 0.020886 0.285614
C  -2.062603 -3.529639 -0.401293
C  -0.75267 0.824371 1.385465
C  -0.005314 -0.57961 -0.38301
C  0.550613 0.991767 1.809371
C  1.309645 -0.426703 0.020226
C  1.589043 0.360689 1.131759
C  -4.839528 0.196871 -2.257999
C  -6.389681 1.295843 -1.224244
C  3.934926 0.268405 0.885488
C  4.806385 -0.702625 1.345711
C  4.215447 0.984769 -0.268099
C  5.977093 -0.958604 0.648983
C  5.380114 0.722431 -0.969187
C  6.258416 -0.246638 -0.506272
H  -3.9975 -2.714389 -0.815615
H  -2.310691 1.242878 -1.843062
H  -2.847907 1.983571 -0.326753
H  -4.220083 -2.163121 1.498607
H  -2.463642 -2.036598 1.713444
H  -2.465822 -4.384218 0.143852
H  -1.115239 -3.254995 0.062077
H  -1.868159 -3.857867 -1.421508
H  -0.205237 -1.196331 -1.248171
H  0.772215 1.613216 2.666301
H  2.098562 -0.924938 -0.525921
H  -4.301811 -0.461264 -2.919565
H  -7.366469 1.650716 -0.94022
H  4.581672 -1.246332 2.253565
H  3.540823 1.757513 -0.61373
H  6.667992 -1.708615 1.007387
H  5.61154 1.281365 -1.865009
H  -6.845573 -0.08686 -2.780131
totalener: -2045.05017088 hartree
nucrepener: 2726.04978880 hartree
electener: -4771.09995968 hartree
oneelecener: -8200.03614612 hartree
twoeener: 3428.93618644 hartree
kineticenergy: 2039.08916357 hartree
xcener: -150.079569578159 hartree
chargesum: 1.0000000
charge: -0.035733 -0.049976 -0.401159 -0.318919 -0.280625 0.122423 -0.206823 -0.124396 0.582034 0.105005 -0.145165 0.003114 -0.166717 -0.269032 0.008200 -0.186224 -0.192834 -0.165433 0.245551 0.145359 0.143162 0.225955 -0.189204 -0.175162 -0.093484 -0.104845 0.058105 0.071922 0.156995 0.159484 0.111309 0.098591 0.107423 0.092027 0.099567 0.151696 0.131771 0.144354 0.212215 0.190726 0.134507 0.134117 0.131817 0.129995 0.208307
qa: -0.0357 -0.0500 -0.4012 -0.3189 -0.2806 0.1224 -0.2068 -0.1244 0.5820 0.1050 -0.1452 0.0031 -0.1667 -0.2690 0.0082 -0.1862 -0.1928 -0.1654 0.2456 0.1454 0.1432 0.2260 -0.1892 -0.1752 -0.0935 -0.1048 0.0581 0.0719 0.1570 0.1595 0.1113 0.0986 0.1074 0.0920 0.0996 0.1517 0.1318 0.1444 0.2122 0.1907 0.1345 0.1341 0.1318 0.1300 0.2083
va: 1.2937 1.2541 1.9493 2.0223 2.1359 3.4766 2.9117 3.5429 3.8864 3.8908 3.6972 3.9298 3.5322 3.9861 4.0727 3.9893 4.0814 3.9881 3.9206 3.9369 3.9270 3.7899 4.0500 4.0020 3.9646 3.9752 3.9861 0.9992 1.0021 1.0319 0.9993 1.0065 1.0077 1.0016 1.0063 1.0144 1.0253 1.0068 0.9862 0.9804 1.0094 1.0026 1.0080 1.0097 0.9919
dispersion: -0.024878717 hartree
energy: -2045.075049594618 hartree
dipole: -23.57067 15.66765 -7.90302 -15.18493 14.53335 -0.65158 -6.75807 3.62871 -3.12936
magnitude: 8.52497 au
magnitude: 21.66876 debye
