program: Orca
programVersion: 5.0.2
elementType: Cl Cl O O O N N N C C C C C C C C C C C C C C C C C C C H H H H H H H H H H H H H H H H H H
charge: 1
multiplicity: 1
keywords: wb97x-d3
keywords: def2-TZVPP
keywords: def2/J RIJCOSX
keywords: DEFGRID2
keywords: scfconv7
keywords: smallprint printgap noloewdin
keywords: NOSOSCF
formula: C19H18Cl2N3O3
InChI: InChI=1/C19H18Cl2N3O3/c1-13-9-25-19(27-13,10-24-12-22-11-23-24)17-7-6-16(8-18(17)21)26-15-4-2-14(20)3-5-15/h2-8,11-13,22H,9-10H2,1H3
45 atoms
Cl -0.51289 -1.219948 -2.089106
Cl 7.113969 0.217266 -0.830743
O  -2.974329 -2.238389 -0.726993
O  -3.963783 -0.947214 0.787117
O  1.915436 1.067539 1.722284
N  -3.699276 1.307726 -0.90094
N  -2.814631 2.23701 -1.285346
N  -4.214621 3.059401 0.163489
C  -3.016819 -0.946693 -0.244237
C  -3.218289 -3.128727 0.360398
C  -3.586627 -0.067097 -1.3679
C  -3.8975 -2.224688 1.40911
C  -1.671672 -0.42736 0.247767
C  -1.951644 -3.791502 0.859074
C  -0.507182 -0.511378 -0.513382
C  -1.564019 0.187037 1.495076
C  0.708516 -0.02759 -0.056893
C  -0.36581 0.6742 1.976656
C  0.783453 0.564038 1.198739
C  -4.548351 1.784052 -0.019883
C  -3.136513 3.303709 -0.63241
C  3.120808 0.844847 1.094276
C  3.726858 -0.399283 1.167966
C  3.733107 1.895185 0.433957
C  4.959952 -0.593972 0.568425
C  4.971246 1.703186 -0.15891
C  5.577675 0.458373 -0.092391
H  -3.909072 -3.888368 -0.011447
H  -4.573255 -0.424737 -1.661863
H  -2.93676 -0.053962 -2.238741
H  -4.911831 -2.53993 1.652943
H  -3.316012 -2.175502 2.335005
H  -2.191261 -4.496156 1.6566
H  -1.240508 -3.065005 1.253309
H  -1.465199 -4.350155 0.061125
H  -2.439843 0.268513 2.124772
H  1.58359 -0.117329 -0.685856
H  -0.307076 1.127373 2.957074
H  -5.349749 1.247026 0.45952
H  -2.633812 4.253714 -0.703893
H  3.248544 -1.212854 1.697947
H  3.254735 2.864751 0.394646
H  5.443409 -1.559227 0.622595
H  5.461553 2.520226 -0.669243
H  -4.681332 3.713399 0.776159
totalener: -2045.04810521 hartree
nucrepener: 2806.24439111 hartree
electener: -4851.29249632 hartree
oneelecener: -8359.92664669 hartree
twoeener: 3508.63415037 hartree
kineticenergy: 2039.08376907 hartree
xcener: -150.079629646387 hartree
chargesum: 1.0000000
charge: -0.026227 -0.045252 -0.318938 -0.395724 -0.281297 0.123177 -0.216571 -0.116466 0.608770 0.189121 -0.127220 -0.079269 -0.309512 -0.287309 0.004901 -0.101613 -0.125188 -0.252040 0.279125 0.156288 0.147356 0.213288 -0.165670 -0.172768 -0.106794 -0.103557 0.064933 0.095395 0.140702 0.159774 0.110974 0.103270 0.103637 0.080879 0.107823 0.142059 0.127869 0.138858 0.209158 0.189448 0.135859 0.126638 0.132700 0.130978 0.208438
qa: -0.0262 -0.0453 -0.3189 -0.3957 -0.2813 0.1232 -0.2166 -0.1165 0.6088 0.1891 -0.1272 -0.0793 -0.3095 -0.2873 0.0049 -0.1016 -0.1252 -0.2520 0.2791 0.1563 0.1474 0.2133 -0.1657 -0.1728 -0.1068 -0.1036 0.0649 0.0954 0.1407 0.1598 0.1110 0.1033 0.1036 0.0809 0.1078 0.1421 0.1279 0.1389 0.2092 0.1894 0.1359 0.1266 0.1327 0.1310 0.2084
va: 1.3097 1.2586 2.0561 1.9525 2.1363 3.4581 2.8956 3.5521 3.8293 3.8377 3.7657 3.9656 3.5205 3.9839 4.1165 3.8015 3.9207 4.1314 3.8753 3.9376 3.9189 3.7941 4.0091 4.0414 3.9767 3.9766 3.9890 0.9970 1.0227 1.0300 1.0029 0.9937 1.0102 0.9953 1.0094 1.0169 1.0311 1.0144 0.9912 0.9811 1.0035 1.0099 1.0089 1.0091 0.9920
dispersion: -0.026400418 hartree
energy: -2045.074505626688 hartree
dipole: -28.08934 21.50509 -6.58425 -6.28316 9.01765 2.73449 13.35091 -12.41703 0.93388
magnitude: 7.19040 au
magnitude: 18.27656 debye
