program: Orca
programVersion: 5.0.2
elementType: Cl Cl O O O N N N C C C C C C C C C C C C C C C C C C C H H H H H H H H H H H H H H H H H H
charge: 1
multiplicity: 1
keywords: wb97x-d3
keywords: def2-TZVPP
keywords: def2/J RIJCOSX
keywords: DEFGRID2
keywords: scfconv7
keywords: smallprint printgap noloewdin
keywords: NOSOSCF
formula: C19H18Cl2N3O3
InChI: InChI=1/C19H18Cl2N3O3/c1-13-9-25-19(27-13,10-24-12-22-11-23-24)17-7-6-16(8-18(17)21)26-15-4-2-14(20)3-5-15/h2-8,11-13,22H,9-10H2,1H3
45 atoms
Cl -0.79591 0.151205 2.403787
Cl 7.033112 1.025232 1.726179
O  -3.65681 -1.509151 -0.659099
O  -2.964532 -1.697555 1.458856
O  2.291385 0.22519 -1.608518
N  -3.710021 1.315941 -0.412117
N  -2.924526 2.400466 -0.455313
N  -4.032822 2.178678 -2.314692
C  -2.920839 -0.869713 0.352372
C  -3.829152 -2.892828 -0.307418
C  -3.676158 0.415881 0.732066
C  -2.974429 -3.015955 0.951571
C  -1.508089 -0.572354 -0.130218
C  -3.416646 -3.80559 -1.436977
C  -0.502855 -0.114426 0.721049
C  -1.171543 -0.729021 -1.474419
C  0.777925 0.15824 0.267524
C  0.094896 -0.462737 -1.953043
C  1.08147 -0.021853 -1.076672
C  -4.381401 1.161806 -1.529697
C  -3.129024 2.922512 -1.618567
C  3.381467 0.408032 -0.788086
C  3.937231 -0.667971 -0.114407
C  3.939849 1.669956 -0.693721
C  5.06506 -0.475944 0.665507
C  5.072324 1.861423 0.082233
C  5.62754 0.788662 0.761642
H  -4.886625 -3.048006 -0.068264
H  -3.18569 0.952109 1.540079
H  -4.697867 0.17946 1.029071
H  -3.400426 -3.676008 1.70507
H  -1.959196 -3.357885 0.716862
H  -3.565735 -4.845152 -1.143329
H  -2.364473 -3.677104 -1.692045
H  -4.015146 -3.635771 -2.331107
H  -1.915902 -1.095366 -2.167328
H  1.525796 0.505976 0.966827
H  0.333836 -0.610633 -2.997533
H  -5.071258 0.368549 -1.763041
H  -2.659396 3.817301 -1.991759
H  3.504354 -1.655753 -0.204872
H  3.503954 2.498817 -1.234859
H  5.51056 -1.309435 1.189772
H  5.521288 2.841769 0.155431
H  -4.38243 2.357267 -3.245667
totalener: -2045.04932521 hartree
nucrepener: 2788.85347178 hartree
electener: -4833.90279700 hartree
oneelecener: -8325.17444442 hartree
twoeener: 3491.27164742 hartree
kineticenergy: 2039.09250572 hartree
xcener: -150.080340277002 hartree
chargesum: 1.0000000
charge: -0.028796 -0.045962 -0.410363 -0.305121 -0.281924 0.128146 -0.217698 -0.116875 0.582387 0.083628 -0.145734 0.019696 -0.207683 -0.260136 -0.004506 -0.135058 -0.130004 -0.241688 0.264979 0.157462 0.148354 0.208487 -0.160864 -0.177262 -0.106421 -0.101409 0.063590 0.084439 0.159556 0.140989 0.117170 0.086069 0.108996 0.084047 0.093712 0.145028 0.130073 0.138729 0.206024 0.189329 0.136767 0.127997 0.132237 0.131390 0.208222
qa: -0.0288 -0.0460 -0.4104 -0.3051 -0.2819 0.1281 -0.2177 -0.1169 0.5824 0.0836 -0.1457 0.0197 -0.2077 -0.2601 -0.0045 -0.1351 -0.1300 -0.2417 0.2650 0.1575 0.1484 0.2085 -0.1609 -0.1773 -0.1064 -0.1014 0.0636 0.0844 0.1596 0.1410 0.1172 0.0861 0.1090 0.0840 0.0937 0.1450 0.1301 0.1387 0.2060 0.1893 0.1368 0.1280 0.1322 0.1314 0.2082
va: 1.3071 1.2584 1.9418 2.0608 2.1328 3.4493 2.8961 3.5520 3.8617 3.9482 3.7895 3.9402 3.5036 3.9540 4.1331 3.8219 3.9236 4.1239 3.8900 3.9381 3.9189 3.8011 4.0094 4.0417 3.9791 3.9744 3.9901 1.0035 1.0318 1.0183 0.9968 1.0059 1.0094 1.0042 1.0060 1.0154 1.0282 1.0141 0.9945 0.9811 1.0024 1.0101 1.0091 1.0089 0.9921
dispersion: -0.025792122 hartree
energy: -2045.075117334907 hartree
dipole: -29.24476 22.80078 -6.44398 -14.57764 15.79979 1.22215 -16.33092 13.15820 -3.17272
magnitude: 7.28592 au
magnitude: 18.51935 debye
