program: Orca
programVersion: 5.0.2
elementType: Cl Cl O O O N N N C C C C C C C C C C C C C C C C C C C H H H H H H H H H H H H H H H H H H
charge: 1
multiplicity: 1
keywords: wb97x-d3
keywords: def2-TZVPP
keywords: def2/J RIJCOSX
keywords: DEFGRID2
keywords: scfconv7
keywords: smallprint printgap noloewdin
keywords: NOSOSCF
formula: C19H18Cl2N3O3
InChI: InChI=1/C19H18Cl2N3O3/c1-13-9-25-19(27-13,10-24-12-22-11-23-24)17-7-6-16(8-18(17)21)26-15-4-2-14(20)3-5-15/h2-8,11-13,22H,9-10H2,1H3
45 atoms
Cl -2.289655 0.293275 3.074758
Cl 7.275117 -0.090558 -1.435509
O  -2.904152 -1.642191 -0.964893
O  -3.324486 -1.778037 1.241725
O  2.264005 1.207213 1.302781
N  -3.563237 1.073815 -1.050981
N  -2.770763 2.146358 -0.886868
N  -3.255972 1.855688 -2.985953
C  -2.89688 -0.917027 0.232675
C  -3.225444 -3.01055 -0.69009
C  -3.918627 0.231324 0.073068
C  -3.968739 -2.885092 0.628068
C  -1.506749 -0.383277 0.540663
C  -1.983553 -3.872974 -0.617498
C  -1.156056 0.178242 1.768335
C  -0.528176 -0.387098 -0.44812
C  0.111723 0.677267 2.009334
C  0.742022 0.124781 -0.242985
C  1.063825 0.650749 0.999688
C  -3.859189 0.883512 -2.316839
C  -2.594574 2.615921 -2.078866
C  3.399968 0.861477 0.621207
C  4.227031 1.891103 0.200935
C  3.762242 -0.463511 0.418463
C  5.428178 1.599475 -0.426411
C  4.95561 -0.755766 -0.222001
C  5.780978 0.27696 -0.640274
H  -3.880853 -3.357294 -1.490823
H  -3.96413 0.866493 0.954388
H  -4.912618 -0.17727 -0.109491
H  -5.036623 -2.692089 0.479679
H  -3.858611 -3.752341 1.278777
H  -2.268939 -4.918724 -0.495116
H  -1.342583 -3.600271 0.222801
H  -1.398857 -3.797523 -1.534742
H  -0.756678 -0.795369 -1.422193
H  0.363751 1.094795 2.97561
H  1.457064 0.109283 -1.054573
H  -4.478123 0.102768 -2.727568
H  -2.011557 3.485679 -2.331331
H  3.941494 2.921532 0.36988
H  3.130199 -1.273696 0.759537
H  6.07516 2.403899 -0.749034
H  5.238667 -1.787603 -0.380471
H  -3.296551 1.999619 -3.989029
elementType: Cl O N C H
totalener: -2045.14816139 hartree
nucrepener: 2770.94618729 hartree
electener: -4816.09434868 hartree
oneelecener: -8289.85638410 hartree
twoeener: 3473.76203542 hartree
cpcmener: -0.10865235 hartree
kineticenergy: 2039.02617924 hartree
xcener: -150.070040824757 hartree
chargesum: 1.0000000
charge: -0.072412 -0.094617 -0.425953 -0.363774 -0.317336 0.132707 -0.293463 -0.093539 0.642920 0.166272 -0.143699 0.007622 -0.160634 -0.304363 0.011789 -0.114927 -0.230555 -0.225368 0.306478 0.189039 0.155685 0.304502 -0.253129 -0.218026 -0.103021 -0.119215 0.060562 0.089464 0.141378 0.144247 0.091546 0.104050 0.104088 0.096094 0.093061 0.145038 0.128254 0.156657 0.216774 0.199850 0.148316 0.161571 0.145676 0.146344 0.244046
qa: -0.0724 -0.0946 -0.4260 -0.3638 -0.3173 0.1327 -0.2935 -0.0935 0.6429 0.1663 -0.1437 0.0076 -0.1606 -0.3044 0.0118 -0.1149 -0.2306 -0.2254 0.3065 0.1890 0.1557 0.3045 -0.2531 -0.2180 -0.1030 -0.1192 0.0606 0.0895 0.1414 0.1442 0.0915 0.1040 0.1041 0.0961 0.0931 0.1450 0.1283 0.1567 0.2168 0.1998 0.1483 0.1616 0.1457 0.1463 0.2440
va: 1.2507 1.2081 1.9671 2.0088 2.0983 3.4327 2.8898 3.5648 3.7658 3.9225 3.9017 3.9954 3.5453 3.9509 4.0165 3.8305 4.1379 4.0039 3.7873 3.9230 3.9335 3.6774 4.0504 3.9757 3.9446 3.9528 3.8602 0.9999 1.0271 0.9997 0.9974 0.9931 1.0081 1.0007 1.0073 1.0270 1.0272 0.9980 0.9757 0.9779 1.0060 0.9938 1.0021 1.0031 0.9673
dispersion: -0.025415035 hartree
energy: -2045.173576421650 hartree
dipole: -23.02851 15.88922 -7.13929 -12.53848 13.59981 1.06133 -10.97471 5.56888 -5.40583
magnitude: 9.01770 au
magnitude: 22.92117 debye
