program: Orca
programVersion: 5.0.2
elementType: Cl Cl O O O N N N C C C C C C C C C C C C C C C C C C C H H H H H H H H H H H H H H H H H H
charge: 1
multiplicity: 1
keywords: wb97x-d3
keywords: def2-TZVPP
keywords: def2/J RIJCOSX
keywords: DEFGRID2
keywords: scfconv7
keywords: smallprint printgap noloewdin
keywords: NOSOSCF
formula: C19H18Cl2N3O3
InChI: InChI=1/C19H18Cl2N3O3/c1-13-9-25-19(27-13,10-24-12-22-11-23-24)17-7-6-16(8-18(17)21)26-15-4-2-14(20)3-5-15/h2-8,11-13,22H,9-10H2,1H3
45 atoms
Cl -0.790529 0.017137 2.433638
Cl 7.29213 0.826257 1.70037
O  -3.4680 -1.588068 -0.826451
O  -2.863322 -1.853408 1.327624
O  2.389255 0.485055 -1.481342
N  -3.724912 1.230958 -0.420428
N  -4.699904 1.150277 -1.341046
N  -3.314372 2.757026 -1.818975
C  -2.831162 -0.966488 0.245999
C  -4.119831 -2.771008 -0.357881
C  -3.643074 0.277377 0.667774
C  -3.26129 -3.125154 0.838604
C  -1.40888 -0.600745 -0.162129
C  -4.163889 -3.805986 -1.451179
C  -0.448806 -0.144576 0.740305
C  -1.023537 -0.672815 -1.499854
C  0.829253 0.220002 0.344058
C  0.245965 -0.327514 -1.921618
C  1.177517 0.11995 -0.995373
C  -2.877671 2.196027 -0.700664
C  -4.437873 2.092694 -2.186757
C  3.496687 0.547118 -0.676872
C  4.259662 1.702472 -0.732653
C  3.894818 -0.527953 0.10625
C  5.43627 1.787488 -0.005009
C  5.063553 -0.438441 0.845466
C  5.826301 0.718322 0.784603
H  -5.138599 -2.52438 -0.034719
H  -3.200325 0.781065 1.523793
H  -4.660672 -0.010037 0.928187
H  -3.805713 -3.648984 1.62348
H  -2.39134 -3.7259 0.547935
H  -4.648092 -4.709677 -1.079642
H  -3.162271 -4.07146 -1.791902
H  -4.741325 -3.453885 -2.30618
H  -1.731105 -1.016639 -2.240586
H  1.534704 0.577963 1.082075
H  0.513088 -0.403825 -2.967629
H  -2.008203 2.479435 -0.128737
H  -5.020573 2.3328 -3.060218
H  3.9448 2.53245 -1.352112
H  3.310328 -1.438783 0.142317
H  6.035738 2.6863 -0.054692
H  5.376808 -1.275053 1.455323
H  -2.886096 3.544006 -2.29433
elementType: Cl O N C H
totalener: -2045.14951127 hartree
nucrepener: 2762.47735202 hartree
electener: -4807.62686329 hartree
oneelecener: -8271.86710395 hartree
twoeener: 3464.24024066 hartree
cpcmener: -0.10621954 hartree
kineticenergy: 2039.02118001 hartree
xcener: -150.068762281338 hartree
chargesum: 1.0000000
charge: -0.069829 -0.093239 -0.394436 -0.372601 -0.313647 0.140500 -0.285108 -0.090325 0.551965 0.129297 -0.151792 0.045795 -0.165012 -0.271672 0.019303 -0.077823 -0.173670 -0.276653 0.316665 0.175295 0.153405 0.290223 -0.248463 -0.208938 -0.104268 -0.117683 0.062860 0.074795 0.158413 0.137827 0.109540 0.075568 0.098438 0.082224 0.098852 0.148065 0.132701 0.147933 0.219395 0.199485 0.149098 0.161943 0.145191 0.146337 0.244047
qa: -0.0698 -0.0932 -0.3944 -0.3726 -0.3136 0.1405 -0.2851 -0.0903 0.5520 0.1293 -0.1518 0.0458 -0.1650 -0.2717 0.0193 -0.0778 -0.1737 -0.2767 0.3167 0.1753 0.1534 0.2902 -0.2485 -0.2089 -0.1043 -0.1177 0.0629 0.0748 0.1584 0.1378 0.1095 0.0756 0.0984 0.0822 0.0989 0.1481 0.1327 0.1479 0.2194 0.1995 0.1491 0.1619 0.1452 0.1463 0.2440
va: 1.2559 1.2097 1.9908 2.0051 2.1016 3.4330 2.9167 3.5621 3.9305 3.9414 3.8499 3.9368 3.5736 3.9535 3.9986 3.8454 3.9818 4.0848 3.7712 3.9212 3.9423 3.6853 4.0520 3.9800 3.9469 3.9532 3.8609 1.0028 1.0144 1.0175 0.9949 1.0033 1.0049 1.0093 1.0029 1.0233 1.0251 1.0085 0.9668 0.9778 1.0056 0.9928 1.0024 1.0030 0.9671
dispersion: -0.025099055 hartree
energy: -2045.174610328483 hartree
dipole: -30.27789 24.12121 -6.15668 -11.73694 14.99979 3.26285 -14.87279 12.10022 -2.77256
magnitude: 7.49920 au
magnitude: 19.06146 debye
