program: Orca
programVersion: 5.0.2
elementType: Cl Cl O O O N N N C C C C C C C C C C C C C C C C C C C H H H H H H H H H H H H H H H H H H
charge: 1
multiplicity: 1
keywords: wb97x-d3
keywords: def2-TZVPP
keywords: def2/J RIJCOSX
keywords: DEFGRID2
keywords: scfconv7
keywords: smallprint printgap noloewdin
keywords: NOSOSCF
formula: C19H18Cl2N3O3
InChI: InChI=1/C19H18Cl2N3O3/c1-13-9-25-19(27-13,10-24-12-22-11-23-24)17-7-6-16(8-18(17)21)26-15-4-2-14(20)3-5-15/h2-8,11-13,22H,9-10H2,1H3
45 atoms
Cl -2.341202 0.386166 3.096595
Cl 7.220712 -0.170354 -1.448399
O  -2.979058 -1.593038 -0.904647
O  -3.48266 -1.63482 1.272017
O  2.249391 1.137983 1.355115
N  -3.615842 1.110306 -1.100067
N  -2.779428 2.157886 -1.013852
N  -3.350834 1.78826 -3.078912
C  -2.978523 -0.822211 0.263201
C  -3.091763 -2.981207 -0.554802
C  -3.972646 0.333535 0.068937
C  -3.036151 -2.944141 0.96797
C  -1.56889 -0.321857 0.566802
C  -2.001638 -3.80307 -1.195966
C  -1.204621 0.224514 1.797474
C  -0.586299 -0.351999 -0.417644
C  0.0782 0.678642 2.046543
C  0.699387 0.117265 -0.206484
C  1.033543 0.624692 1.040785
C  -3.964786 0.872697 -2.34424
C  -2.629293 2.564003 -2.232375
C  3.373548 0.790514 0.65511
C  4.208139 1.817595 0.2439
C  3.718536 -0.534959 0.427381
C  5.400342 1.523078 -0.398679
C  4.903201 -0.829992 -0.227999
C  5.736539 0.20033 -0.63642
H  -4.071091 -3.332494 -0.894335
H  -3.994779 1.009176 0.920818
H  -4.974182 -0.067632 -0.082922
H  -3.703891 -3.661437 1.4428
H  -2.018405 -3.11239 1.340267
H  -1.011048 -3.491105 -0.862092
H  -2.040113 -3.73863 -2.283602
H  -2.131605 -4.852658 -0.927012
H  -0.824941 -0.748241 -1.394501
H  0.339792 1.084132 3.015391
H  1.416049 0.08308 -1.016004
H  -4.626556 0.097385 -2.694426
H  -2.025058 3.398553 -2.546271
H  3.935727 2.84807 0.432935
H  3.079745 -1.343197 0.760489
H  6.053765 2.3254 -0.713333
H  5.173397 -1.862118 -0.405898
H  -3.424889 1.888899 -4.08533
elementType: Cl O N C H
totalener: -2045.14862965 hartree
nucrepener: 2772.05362048 hartree
electener: -4817.20225012 hartree
oneelecener: -8291.90006339 hartree
twoeener: 3474.69781327 hartree
cpcmener: -0.10664277 hartree
kineticenergy: 2039.03666515 hartree
xcener: -150.072207930877 hartree
chargesum: 1.0000000
charge: -0.072854 -0.094233 -0.417553 -0.357666 -0.316091 0.131212 -0.298726 -0.093436 0.627918 0.121879 -0.088112 0.017834 -0.187833 -0.281852 0.041812 -0.157765 -0.236151 -0.220805 0.312204 0.190033 0.157248 0.303599 -0.251230 -0.219358 -0.103233 -0.118580 0.060710 0.081154 0.144573 0.137145 0.118508 0.087399 0.084648 0.096364 0.104496 0.149954 0.127260 0.156201 0.216699 0.200296 0.148232 0.161870 0.145677 0.146254 0.244300
qa: -0.0729 -0.0942 -0.4176 -0.3577 -0.3161 0.1312 -0.2987 -0.0934 0.6279 0.1219 -0.0881 0.0178 -0.1878 -0.2819 0.0418 -0.1578 -0.2362 -0.2208 0.3122 0.1900 0.1572 0.3036 -0.2512 -0.2194 -0.1032 -0.1186 0.0607 0.0812 0.1446 0.1371 0.1185 0.0874 0.0846 0.0964 0.1045 0.1500 0.1273 0.1562 0.2167 0.2003 0.1482 0.1619 0.1457 0.1463 0.2443
va: 1.2502 1.2085 1.9652 2.0120 2.0999 3.4336 2.8883 3.5658 3.8241 3.9445 3.8124 3.9318 3.5481 3.9561 3.9850 3.8812 4.1350 3.9989 3.7793 3.9240 3.9315 3.6769 4.0514 3.9788 3.9445 3.9522 3.8605 1.0047 1.0228 1.0170 0.9947 1.0047 1.0029 1.0040 1.0065 1.0205 1.0283 0.9984 0.9758 0.9775 1.0060 0.9937 1.0022 1.0031 0.9671
dispersion: -0.025393874 hartree
energy: -2045.174023518828 hartree
dipole: -20.72032 14.07218 -6.64814 -12.84085 13.78494 0.94409 -11.64460 6.32428 -5.32032
magnitude: 8.56708 au
magnitude: 21.77579 debye
