program: Orca
programVersion: 5.0.2
elementType: Cl Cl O O O N N N C C C C C C C C C C C C C C C C C C C H H H H H H H H H H H H H H H H H H
charge: 1
multiplicity: 1
keywords: wb97x-d3
keywords: def2-TZVPP
keywords: def2/J RIJCOSX
keywords: DEFGRID2
keywords: scfconv7
keywords: smallprint printgap noloewdin
keywords: NOSOSCF
formula: C19H18Cl2N3O3
InChI: InChI=1/C19H18Cl2N3O3/c1-13-9-25-19(27-13,10-24-12-22-11-23-24)17-7-6-16(8-18(17)21)26-15-4-2-14(20)3-5-15/h2-8,11-13,22H,9-10H2,1H3
45 atoms
Cl -2.293438 0.223051 3.087474
Cl 7.318431 -0.034374 -1.292493
O  -2.844516 -1.714865 -0.943651
O  -3.398861 -1.793565 1.238026
O  2.233524 1.242857 1.31612
N  -3.483792 1.082364 -0.999496
N  -3.829971 0.83463 -2.273525
N  -2.55537 2.591446 -2.144483
C  -2.890282 -0.966989 0.232544
C  -3.526248 -2.954772 -0.734005
C  -3.893096 0.19501 0.070037
C  -3.368569 -3.129257 0.76206
C  -1.496492 -0.43973 0.54956
C  -2.904727 -4.039619 -1.574776
C  -1.159102 0.12624 1.779868
C  -0.512363 -0.427416 -0.43573
C  0.097887 0.651851 2.023149
C  0.746763 0.10999 -0.226571
C  1.051743 0.648221 1.015328
C  -2.708026 2.139277 -0.908056
C  -3.257328 1.767632 -2.961214
C  3.388126 0.900164 0.664412
C  4.204112 1.933672 0.232052
C  3.777506 -0.422752 0.504138
C  5.42191 1.647928 -0.365166
C  4.988333 -0.709505 -0.105479
C  5.80266 0.326847 -0.536309
H  -4.585307 -2.838129 -0.994109
H  -3.975911 0.783413 0.981647
H  -4.880556 -0.189221 -0.181569
H  -4.184196 -3.684923 1.223283
H  -2.419308 -3.616936 1.013735
H  -3.000354 -3.822468 -2.638684
H  -3.41556 -4.984651 -1.387124
H  -1.847954 -4.171488 -1.338623
H  -0.729313 -0.841494 -1.410267
H  0.339641 1.072568 2.990648
H  1.465596 0.108007 -1.035151
H  -2.287942 2.557248 -0.007155
H  -3.324025 1.891835 -4.029104
H  3.897705 2.962814 0.369629
H  3.152999 -1.235476 0.853225
H  6.061104 2.455609 -0.695286
H  5.292664 -1.73972 -0.231674
H  -2.014795 3.404899 -2.417222
elementType: Cl O N C H
totalener: -2045.14862917 hartree
nucrepener: 2761.70397878 hartree
electener: -4806.85260795 hartree
oneelecener: -8270.10651657 hartree
twoeener: 3463.25390862 hartree
cpcmener: -0.10662382 hartree
kineticenergy: 2039.02779526 hartree
xcener: -150.069917574838 hartree
chargesum: 1.0000000
charge: -0.069505 -0.093964 -0.394116 -0.370628 -0.317855 0.139531 -0.284440 -0.089183 0.559912 0.129125 -0.149389 0.041314 -0.148086 -0.271024 0.055250 -0.125850 -0.235435 -0.208003 0.300464 0.173431 0.153598 0.301510 -0.254305 -0.212634 -0.102963 -0.120173 0.060914 0.074933 0.156351 0.136356 0.110085 0.076772 0.098685 0.097741 0.082183 0.147997 0.128048 0.158034 0.219618 0.199416 0.148228 0.161410 0.146002 0.146750 0.243896
qa: -0.0695 -0.0940 -0.3941 -0.3706 -0.3179 0.1395 -0.2844 -0.0892 0.5599 0.1291 -0.1494 0.0413 -0.1481 -0.2710 0.0552 -0.1258 -0.2354 -0.2080 0.3005 0.1734 0.1536 0.3015 -0.2543 -0.2126 -0.1030 -0.1202 0.0609 0.0749 0.1564 0.1364 0.1101 0.0768 0.0987 0.0977 0.0822 0.1480 0.1280 0.1580 0.2196 0.1994 0.1482 0.1614 0.1460 0.1467 0.2439
va: 1.2518 1.2087 1.9938 2.0060 2.0958 3.4337 2.9167 3.5610 3.9194 3.9439 3.8676 3.9398 3.5924 3.9527 3.9598 3.8888 4.1384 3.9820 3.7835 3.9226 3.9411 3.6786 4.0493 3.9735 3.9461 3.9546 3.8616 1.0026 1.0115 1.0183 0.9949 1.0033 1.0028 1.0049 1.0096 1.0261 1.0280 0.9973 0.9662 0.9779 1.0060 0.9937 1.0021 1.0030 0.9672
dispersion: -0.025115097 hartree
energy: -2045.173744269739 hartree
dipole: -22.44939 17.42595 -5.02344 -11.05999 14.19812 3.13813 -10.94892 7.86386 -3.08506
magnitude: 6.67836 au
magnitude: 16.97504 debye
