program: Orca
programVersion: 5.0.2
elementType: Cl Cl O O O N N N C C C C C C C C C C C C C C C C C C C H H H H H H H H H H H H H H H H H H
charge: 1
multiplicity: 1
keywords: wb97x-d3
keywords: def2-TZVPP
keywords: def2/J RIJCOSX
keywords: DEFGRID2
keywords: scfconv7
keywords: smallprint printgap noloewdin
keywords: NOSOSCF
formula: C19H18Cl2N3O3
InChI: InChI=1/C19H18Cl2N3O3/c1-13-9-25-19(27-13,10-24-12-22-11-23-24)17-7-6-16(8-18(17)21)26-15-4-2-14(20)3-5-15/h2-8,11-13,22H,9-10H2,1H3
45 atoms
Cl -1.873202 -1.427846 -3.017435
Cl 6.740915 2.0491 2.173924
O  -3.303787 -2.262518 -0.529406
O  -3.027144 -1.049356 1.349117
O  2.633482 -0.207936 -1.335874
N  -3.366575 1.366384 0.002712
N  -3.986585 1.785214 1.118139
N  -2.438513 3.189632 0.518763
C  -2.839682 -1.043495 -0.036204
C  -4.005416 -2.945914 0.51444
C  -3.707181 0.097415 -0.609379
C  -3.337956 -2.375034 1.749046
C  -1.369917 -0.850379 -0.386741
C  -3.86554 -4.43635 0.34586
C  -0.862251 -0.979566 -1.681391
C  -0.464529 -0.481864 0.602451
C  0.469153 -0.748911 -1.972833
C  0.878838 -0.25831 0.343951
C  1.344928 -0.386386 -0.956277
C  -2.425686 2.20549 -0.369052
C  -3.41021 2.902401 1.419704
C  3.555286 0.330792 -0.475163
C  3.421134 1.625079 0.006987
C  4.666431 -0.432256 -0.156961
C  4.402999 2.153293 0.829427
C  5.657735 0.099947 0.653456
C  5.51383 1.386187 1.14772
H  -5.065083 -2.663343 0.490966
H  -4.760377 -0.089932 -0.403715
H  -3.580713 0.197469 -1.684925
H  -3.994669 -2.334964 2.617396
H  -2.430796 -2.9308 2.01387
H  -4.381196 -4.944768 1.161434
H  -2.819011 -4.743215 0.361457
H  -4.315367 -4.775577 -0.587093
H  -0.809322 -0.369603 1.620801
H  0.837092 -0.857352 -2.985002
H  1.534546 0.00699 1.161874
H  -1.781808 2.11596 -1.229409
H  -3.658494 3.531281 2.258026
H  2.560637 2.227965 -0.255082
H  4.766611 -1.437494 -0.545856
H  4.300802 3.160856 1.209101
H  6.528331 -0.493344 0.898266
H  -1.839212 4.007744 0.508437
elementType: Cl O N C H
totalener: -2045.14878603 hartree
nucrepener: 2757.54512292 hartree
electener: -4802.69390896 hartree
oneelecener: -8261.73865453 hartree
twoeener: 3459.04474557 hartree
cpcmener: -0.10809321 hartree
kineticenergy: 2039.02363787 hartree
xcener: -150.068573818298 hartree
chargesum: 1.0000000
charge: -0.071783 -0.091724 -0.376602 -0.400306 -0.313501 0.137613 -0.282552 -0.092435 0.639107 0.140333 -0.153626 0.017473 -0.225602 -0.268350 0.028867 -0.079863 -0.237665 -0.232678 0.324174 0.176715 0.152906 0.285107 -0.216273 -0.225488 -0.119425 -0.112069 0.068348 0.073607 0.137241 0.152494 0.108793 0.083355 0.094504 0.081965 0.098863 0.150234 0.128945 0.155156 0.220560 0.200271 0.157372 0.149676 0.145415 0.147181 0.243667
qa: -0.0718 -0.0917 -0.3766 -0.4003 -0.3135 0.1376 -0.2826 -0.0924 0.6391 0.1403 -0.1536 0.0175 -0.2256 -0.2684 0.0289 -0.0799 -0.2377 -0.2327 0.3242 0.1767 0.1529 0.2851 -0.2163 -0.2255 -0.1194 -0.1121 0.0683 0.0736 0.1372 0.1525 0.1088 0.0834 0.0945 0.0820 0.0989 0.1502 0.1289 0.1552 0.2206 0.2003 0.1574 0.1497 0.1454 0.1472 0.2437
va: 1.2513 1.2109 2.0173 1.9845 2.1025 3.4420 2.9152 3.5605 3.7739 3.9341 3.8841 3.9454 3.6653 3.9549 3.9969 3.8177 4.1314 3.9886 3.7826 3.9165 3.9435 3.6819 3.9862 4.0491 3.9501 3.9468 3.8596 1.0009 1.0141 1.0155 0.9976 0.9996 1.0048 1.0103 1.0031 1.0248 1.0277 1.0012 0.9655 0.9774 0.9958 1.0041 1.0033 1.0016 0.9674
dispersion: -0.024817671 hartree
energy: -2045.173603703944 hartree
dipole: -24.40607 19.74999 -4.65608 -10.40306 14.32952 3.92646 7.22666 -6.35234 0.87432
magnitude: 6.15310 au
magnitude: 15.63994 debye
