program: Orca
programVersion: 5.0.2
elementType: Cl Cl O O O N N N C C C C C C C C C C C C C C C C C C C H H H H H H H H H H H H H H H H H H
charge: 1
multiplicity: 1
keywords: wb97x-d3
keywords: def2-TZVPP
keywords: def2/J RIJCOSX
keywords: DEFGRID2
keywords: scfconv7
keywords: smallprint printgap noloewdin
keywords: NOSOSCF
formula: C19H18Cl2N3O3
InChI: InChI=1/C19H18Cl2N3O3/c1-13-9-25-19(27-13,10-24-12-22-11-23-24)17-7-6-16(8-18(17)21)26-15-4-2-14(20)3-5-15/h2-8,11-13,22H,9-10H2,1H3
45 atoms
Cl -1.55295 0.935113 -2.718107
Cl 7.648804 -1.337625 1.80146
O  -3.041648 -0.818593 -0.870692
O  -2.694977 -0.717365 1.319489
O  2.999818 1.15963 -0.733544
N  -4.699666 1.040872 0.22143
N  -5.370024 0.779789 1.354811
N  -6.66396 0.564609 -0.380319
C  -2.494851 -0.0199 0.131652
C  -2.9520 -2.188397 -0.469145
C  -3.276061 1.296317 0.220506
C  -2.5743 -2.096591 1.015941
C  -1.018006 0.277894 -0.112073
C  -1.951286 -2.956994 -1.3006
C  -0.519787 0.698678 -1.345009
C  -0.101653 0.160608 0.928915
C  0.824595 0.960955 -1.539859
C  1.248466 0.421493 0.765195
C  1.709563 0.821363 -0.480719
C  -5.467252 0.903975 -0.835569
C  -6.571777 0.495858 0.971305
C  4.035519 0.539253 -0.089503
C  4.092415 -0.839757 0.062121
C  5.080935 1.340667 0.342555
C  5.204644 -1.417121 0.653888
C  6.198547 0.762588 0.923013
C  6.251938 -0.613205 1.07749
H  -3.946869 -2.622871 -0.594543
H  -3.053789 1.950544 -0.619182
H  -3.021607 1.82526 1.137153
H  -3.251348 -2.652816 1.663601
H  -1.553792 -2.451716 1.195367
H  -2.225271 -2.953995 -2.355838
H  -1.923397 -3.997266 -0.971492
H  -0.944466 -2.547915 -1.201854
H  -0.447809 -0.138914 1.908674
H  1.19036 1.279727 -2.507328
H  1.918507 0.322941 1.609157
H  -5.181061 1.05118 -1.864122
H  -7.394251 0.243948 1.619233
H  3.286123 -1.47402 -0.284256
H  5.030215 2.414722 0.21794
H  5.251719 -2.491548 0.769285
H  7.016292 1.388364 1.253925
H  -7.488415 0.399002 -0.947254
elementType: Cl O N C H
totalener: -2045.15009554 hartree
nucrepener: 2731.42181345 hartree
electener: -4776.57190898 hartree
oneelecener: -8210.88510447 hartree
twoeener: 3434.31319548 hartree
cpcmener: -0.10467569 hartree
kineticenergy: 2039.04087152 hartree
xcener: -150.072759352052 hartree
chargesum: 1.0000000
charge: -0.077864 -0.095408 -0.385623 -0.375289 -0.318601 0.143140 -0.291288 -0.096057 0.610752 0.203493 -0.126019 -0.037370 -0.182940 -0.302662 0.011953 -0.112201 -0.219067 -0.215291 0.274632 0.184294 0.149479 0.292603 -0.202139 -0.255560 -0.124409 -0.101496 0.060254 0.087393 0.160075 0.148184 0.111008 0.100844 0.092831 0.105177 0.087968 0.151237 0.127894 0.157978 0.213264 0.200260 0.160801 0.148515 0.145797 0.145966 0.243495
qa: -0.0779 -0.0954 -0.3856 -0.3753 -0.3186 0.1431 -0.2913 -0.0961 0.6108 0.2035 -0.1260 -0.0374 -0.1829 -0.3027 0.0120 -0.1122 -0.2191 -0.2153 0.2746 0.1843 0.1495 0.2926 -0.2021 -0.2556 -0.1244 -0.1015 0.0603 0.0874 0.1601 0.1482 0.1110 0.1008 0.0928 0.1052 0.0880 0.1512 0.1279 0.1580 0.2133 0.2003 0.1608 0.1485 0.1458 0.1460 0.2435
va: 1.2413 1.2073 1.9796 2.0066 2.0920 3.4390 2.9198 3.5672 3.8517 3.8238 3.7514 3.9369 3.5822 3.9865 3.9603 3.9205 4.1194 3.9793 3.8040 3.9267 3.9436 3.6963 3.9648 4.0484 3.9624 3.9458 3.8590 1.0004 1.0092 1.0198 1.0005 0.9974 1.0075 1.0072 0.9963 1.0183 1.0277 0.9978 0.9779 0.9776 0.9951 1.0062 1.0036 1.0019 0.9675
dispersion: -0.025106567 hartree
energy: -2045.175202105437 hartree
dipole: -24.50147 13.99855 -10.50293 -8.74061 9.15353 0.41292 1.58239 -2.32371 -0.74132
magnitude: 10.53715 au
magnitude: 26.78331 debye
