program: Orca
programVersion: 5.0.2
elementType: Cl Cl O O O N N N C C C C C C C C C C C C C C C C C C C H H H H H H H H H H H H H H H H H H
charge: 1
multiplicity: 1
keywords: wb97x-d3
keywords: def2-TZVPP
keywords: def2/J RIJCOSX
keywords: DEFGRID2
keywords: scfconv7
keywords: smallprint printgap noloewdin
keywords: NOSOSCF
formula: C19H18Cl2N3O3
InChI: InChI=1/C19H18Cl2N3O3/c1-13-9-25-19(27-13,10-24-12-22-11-23-24)17-7-6-16(8-18(17)21)26-15-4-2-14(20)3-5-15/h2-8,11-13,22H,9-10H2,1H3
45 atoms
Cl -1.883564 1.759077 2.20819
Cl 7.852109 -0.497607 -1.319411
O  -2.539306 -1.271924 -1.072295
O  -3.310671 -0.44442 0.85244
O  2.89142 0.531407 1.614859
N  -4.354569 0.974473 -1.226956
N  -4.824678 0.323976 -2.302888
N  -6.453404 0.995167 -1.027213
C  -2.447837 -0.177237 -0.208763
C  -3.154598 -2.37266 -0.394029
C  -2.936529 1.071424 -0.955492
C  -3.290191 -1.849909 1.030138
C  -1.012762 0.030027 0.265625
C  -2.331186 -3.630413 -0.520885
C  -0.680569 0.861264 1.336551
C  0.03961 -0.614489 -0.375407
C  0.626676 1.02901 1.754425
C  1.358453 -0.472288 0.025147
C  1.64913 0.352845 1.101454
C  -5.328094 1.377424 -0.443038
C  -6.11039 0.34863 -2.169045
C  4.010629 0.260618 0.871279
C  4.947574 -0.60633 1.409249
C  4.243259 0.89144 -0.342659
C  6.136399 -0.840159 0.735353
C  5.425764 0.649717 -1.022947
C  6.366196 -0.211209 -0.477119
H  -4.142649 -2.531339 -0.839067
H  -2.410947 1.172088 -1.902873
H  -2.771409 1.978443 -0.378782
H  -4.215047 -2.155951 1.516861
H  -2.444962 -2.155945 1.658372
H  -1.341225 -3.511324 -0.078176
H  -2.212601 -3.924049 -1.564099
H  -2.833999 -4.450777 -0.006399
H  -0.169239 -1.261527 -1.215444
H  0.860172 1.676796 2.589246
H  2.133918 -1.014708 -0.49874
H  -5.228407 1.920554 0.48255
H  -6.822321 -0.071596 -2.859179
H  4.758307 -1.091678 2.357991
H  3.516751 1.577459 -0.759892
H  6.871022 -1.51175 1.158519
H  5.611742 1.14284 -1.967327
H  -7.391102 1.169076 -0.682875
elementType: Cl O N C H
totalener: -2045.15094430 hartree
nucrepener: 2718.02170487 hartree
electener: -4763.17264918 hartree
oneelecener: -8184.26719190 hartree
twoeener: 3421.09454272 hartree
cpcmener: -0.10468636 hartree
kineticenergy: 2039.04239953 hartree
xcener: -150.072643158947 hartree
chargesum: 1.0000000
charge: -0.079739 -0.093504 -0.390962 -0.375209 -0.316514 0.141948 -0.294783 -0.094712 0.587289 0.128716 -0.128214 0.022800 -0.128040 -0.282539 0.025810 -0.151689 -0.237006 -0.208446 0.289138 0.186638 0.151326 0.278455 -0.235349 -0.200845 -0.111691 -0.123571 0.068775 0.079184 0.148486 0.157000 0.116151 0.090771 0.084939 0.098289 0.102081 0.152844 0.127796 0.155776 0.214565 0.199375 0.148954 0.160069 0.146209 0.146182 0.243242
qa: -0.0797 -0.0935 -0.3910 -0.3752 -0.3165 0.1419 -0.2948 -0.0947 0.5873 0.1287 -0.1282 0.0228 -0.1280 -0.2825 0.0258 -0.1517 -0.2370 -0.2084 0.2891 0.1866 0.1513 0.2785 -0.2353 -0.2008 -0.1117 -0.1236 0.0688 0.0792 0.1485 0.1570 0.1162 0.0908 0.0849 0.0983 0.1021 0.1528 0.1278 0.1558 0.2146 0.1994 0.1490 0.1601 0.1462 0.1462 0.2432
va: 1.2407 1.2091 1.9989 1.9785 2.0949 3.4492 2.9141 3.5646 3.8754 3.9301 3.7660 3.8994 3.5609 3.9688 3.9714 3.9660 4.1216 3.9776 3.8091 3.9270 3.9367 3.6964 4.0469 3.9820 3.9496 3.9559 3.8547 1.0036 1.0189 1.0129 0.9987 1.0060 1.0033 1.0038 1.0059 1.0199 1.0281 1.0004 0.9764 0.9780 1.0048 0.9941 1.0020 1.0031 0.9677
dispersion: -0.024712555 hartree
energy: -2045.175656859342 hartree
dipole: -25.84616 15.42846 -10.41770 -13.86058 14.79563 0.93506 -4.22745 3.09983 -1.12763
magnitude: 10.52019 au
magnitude: 26.74020 debye
