program: Orca
programVersion: 5.0.2
elementType: Cl Cl O O O N N N C C C C C C C C C C C C C C C C C C C H H H H H H H H H H H H H H H H H H
charge: 1
multiplicity: 1
keywords: wb97x-d3
keywords: def2-TZVPP
keywords: def2/J RIJCOSX
keywords: DEFGRID2
keywords: scfconv7
keywords: smallprint printgap noloewdin
keywords: NOSOSCF
formula: C19H18Cl2N3O3
InChI: InChI=1/C19H18Cl2N3O3/c1-13-9-25-19(27-13,10-24-12-22-11-23-24)17-7-6-16(8-18(17)21)26-15-4-2-14(20)3-5-15/h2-8,11-13,22H,9-10H2,1H3
45 atoms
Cl -1.575118 0.910775 -2.789023
Cl 7.546226 -1.223762 2.068144
O  -3.08697 -0.78139 -0.90842
O  -2.691705 -0.695178 1.270506
O  3.006216 1.031722 -0.861685
N  -4.684793 1.076996 0.321368
N  -5.475258 1.070611 -0.764193
N  -6.588823 0.484988 1.008737
C  -2.504532 0.006279 0.079199
C  -2.957976 -2.153035 -0.52994
C  -3.264817 1.328803 0.199873
C  -2.571843 -2.073882 0.955262
C  -1.02747 0.280858 -0.18223
C  -1.944858 -2.885483 -1.380201
C  -0.531831 0.669279 -1.426439
C  -0.106654 0.169766 0.854915
C  0.817235 0.891519 -1.637847
C  1.247132 0.397048 0.676299
C  1.708555 0.749876 -0.583526
C  -5.343643 0.716507 1.399335
C  -6.637547 0.711297 -0.327935
C  4.022702 0.473844 -0.134389
C  5.045181 1.314359 0.276791
C  4.080184 -0.88928 0.123875
C  6.138334 0.792187 0.950623
C  5.165938 -1.409937 0.809026
C  6.187553 -0.566447 1.218059
H  -3.942355 -2.610488 -0.655493
H  -3.12072 1.96234 -0.671427
H  -2.923333 1.873726 1.078709
H  -3.242934 -2.636268 1.603747
H  -1.548993 -2.425877 1.126481
H  -1.901299 -3.933673 -1.079126
H  -0.943753 -2.464921 -1.272767
H  -2.220771 -2.857942 -2.434615
H  -0.450157 -0.102959 1.843254
H  1.181933 1.180169 -2.615074
H  1.918748 0.302195 1.518978
H  -4.958129 0.642282 2.402951
H  -7.527181 0.605081 -0.925658
H  4.99634 2.374751 0.064204
H  3.293301 -1.554752 -0.208513
H  6.938112 1.448591 1.266099
H  5.212017 -2.471488 1.011012
H  -7.355761 0.202155 1.608948
elementType: Cl O N C H
totalener: -2045.15006015 hartree
nucrepener: 2733.70193007 hartree
electener: -4778.85199022 hartree
oneelecener: -8215.76540446 hartree
twoeener: 3436.91341425 hartree
cpcmener: -0.10662430 hartree
kineticenergy: 2039.04780841 hartree
xcener: -150.074144832586 hartree
chargesum: 1.0000000
charge: -0.073420 -0.095212 -0.375203 -0.397305 -0.317120 0.131591 -0.283684 -0.096711 0.616072 0.203169 -0.112617 -0.040377 -0.191915 -0.302970 0.020267 -0.115971 -0.221225 -0.231666 0.291074 0.183420 0.145480 0.295879 -0.250956 -0.209652 -0.103549 -0.121327 0.061632 0.090191 0.152452 0.154634 0.110856 0.104260 0.105431 0.086748 0.093269 0.150664 0.127360 0.156602 0.215188 0.200223 0.148508 0.161041 0.146283 0.145325 0.243262
qa: -0.0734 -0.0952 -0.3752 -0.3973 -0.3171 0.1316 -0.2837 -0.0967 0.6161 0.2032 -0.1126 -0.0404 -0.1919 -0.3030 0.0203 -0.1160 -0.2212 -0.2317 0.2911 0.1834 0.1455 0.2959 -0.2510 -0.2097 -0.1035 -0.1213 0.0616 0.0902 0.1525 0.1546 0.1109 0.1043 0.1054 0.0867 0.0933 0.1507 0.1274 0.1566 0.2152 0.2002 0.1485 0.1610 0.1463 0.1453 0.2433
va: 1.2457 1.2076 1.9933 1.9763 2.0969 3.4573 2.9090 3.5623 3.8411 3.8374 3.7452 3.9275 3.6083 3.9846 3.9610 3.9300 4.1205 3.9835 3.7944 3.9261 3.9514 3.6888 4.0481 3.9719 3.9445 3.9579 3.8591 0.9996 1.0218 1.0056 1.0017 0.9985 1.0078 0.9957 1.0085 1.0196 1.0283 0.9986 0.9778 0.9775 1.0059 0.9947 1.0017 1.0037 0.9676
dispersion: -0.025150211 hartree
energy: -2045.175210360302 hartree
dipole: -23.93908 13.74859 -10.19049 -9.05494 9.15279 0.09786 4.60277 -1.62691 2.97586
magnitude: 10.61656 au
magnitude: 26.98516 debye
