program: Orca
programVersion: 5.0.2
elementType: Cl Cl O O O N N N C C C C C C C C C C C C C C C C C C C H H H H H H H H H H H H H H H H H H
charge: 1
multiplicity: 1
keywords: wb97x-d3
keywords: def2-TZVPP
keywords: def2/J RIJCOSX
keywords: DEFGRID2
keywords: scfconv7
keywords: smallprint printgap noloewdin
keywords: NOSOSCF
formula: C19H18Cl2N3O3
InChI: InChI=1/C19H18Cl2N3O3/c1-13-9-25-19(27-13,10-24-12-22-11-23-24)17-7-6-16(8-18(17)21)26-15-4-2-14(20)3-5-15/h2-8,11-13,22H,9-10H2,1H3
45 atoms
Cl -1.9315 1.7483 2.2682
Cl 7.676528 -1.534682 -0.680338
O  -2.517699 -1.160066 -1.129667
O  -3.247893 -0.442284 0.841726
O  2.867466 1.322147 1.052434
N  -4.551872 0.835882 -1.21309
N  -5.498756 1.236681 -0.350128
N  -6.363946 0.054087 -1.955706
C  -2.487647 -0.065426 -0.258369
C  -2.773131 -2.352025 -0.372387
C  -3.154531 1.118151 -0.961187
C  -2.974919 -1.815527 1.045945
C  -1.054483 0.30694 0.108634
C  -1.650513 -3.354256 -0.49299
C  -0.722728 1.090912 1.213899
C  -0.004879 -0.105793 -0.706541
C  0.590973 1.39718 1.523521
C  1.316121 0.204452 -0.435303
C  1.61261 0.946793 0.699328
C  -5.059722 0.113293 -2.185368
C  -6.602612 0.755547 -0.820204
C  3.958011 0.61537 0.618694
C  4.055845 -0.757825 0.799148
C  5.001249 1.329752 0.052555
C  5.202823 -1.420864 0.394876
C  6.155541 0.6693 -0.339575
C  6.243971 -0.703278 -0.174509
H  -3.699529 -2.788105 -0.757061
H  -2.655241 1.313258 -1.909113
H  -3.110327 2.024178 -0.361201
H  -3.821004 -2.268129 1.561172
H  -2.078202 -1.952981 1.661709
H  -0.71039 -2.957307 -0.10773
H  -1.500031 -3.664877 -1.527151
H  -1.897961 -4.247392 0.083588
H  -0.218159 -0.689381 -1.591127
H  0.826315 1.990132 2.39787
H  2.090689 -0.134206 -1.110115
H  -4.52854 -0.328596 -3.01199
H  -7.579891 0.886951 -0.38696
H  3.250188 -1.318685 1.256114
H  4.920555 2.401494 -0.076397
H  5.279776 -2.490988 0.532065
H  6.972276 1.227848 -0.776301
H  -7.046711 -0.425717 -2.531847
elementType: Cl O N C H
totalener: -2045.15064557 hartree
nucrepener: 2726.06465847 hartree
electener: -4771.21530404 hartree
oneelecener: -8200.42086303 hartree
twoeener: 3429.20555899 hartree
cpcmener: -0.10684244 hartree
kineticenergy: 2039.04734973 hartree
xcener: -150.073606374356 hartree
chargesum: 1.0000000
charge: -0.073017 -0.094518 -0.410266 -0.362462 -0.317163 0.132249 -0.284068 -0.097957 0.601096 0.149868 -0.108421 0.006326 -0.124416 -0.287517 0.022397 -0.178776 -0.230828 -0.217775 0.291631 0.183142 0.148745 0.288702 -0.207374 -0.242462 -0.122249 -0.107249 0.064359 0.084276 0.156007 0.147463 0.114116 0.091966 0.086245 0.096732 0.105537 0.151222 0.127965 0.156722 0.214508 0.199978 0.161308 0.148835 0.146138 0.145593 0.243395
qa: -0.0730 -0.0945 -0.4103 -0.3625 -0.3172 0.1322 -0.2841 -0.0980 0.6011 0.1499 -0.1084 0.0063 -0.1244 -0.2875 0.0224 -0.1788 -0.2308 -0.2178 0.2916 0.1831 0.1487 0.2887 -0.2074 -0.2425 -0.1222 -0.1072 0.0644 0.0843 0.1560 0.1475 0.1141 0.0920 0.0862 0.0967 0.1055 0.1512 0.1280 0.1567 0.2145 0.2000 0.1613 0.1488 0.1461 0.1456 0.2434
va: 1.2468 1.2082 1.9724 1.9946 2.0975 3.4598 2.9069 3.5635 3.8652 3.8888 3.7542 3.9253 3.5679 3.9753 3.9782 3.9662 4.1148 3.9740 3.7999 3.9213 3.9487 3.6913 3.9763 4.0473 3.9564 3.9466 3.8577 1.0022 1.0033 1.0227 0.9980 1.0036 1.0002 1.0050 1.0056 1.0216 1.0283 0.9991 0.9785 0.9775 0.9937 1.0053 1.0033 1.0022 0.9676
dispersion: -0.024866462 hartree
energy: -2045.175512035062 hartree
dipole: -22.52034 12.83419 -9.68616 -12.69667 11.61472 -1.08194 -8.69923 4.63314 -4.06609
magnitude: 10.56056 au
magnitude: 26.84280 debye
