program: Orca
programVersion: 5.0.2
elementType: Cl Cl O O O N N N C C C C C C C C C C C C C C C C C C C H H H H H H H H H H H H H H H H H H
charge: 1
multiplicity: 1
keywords: wb97x-d3
keywords: def2-TZVPP
keywords: def2/J RIJCOSX
keywords: DEFGRID2
keywords: scfconv7
keywords: smallprint printgap noloewdin
keywords: NOSOSCF
formula: C19H18Cl2N3O3
InChI: InChI=1/C19H18Cl2N3O3/c1-13-9-25-19(27-13,10-24-12-22-11-23-24)17-7-6-16(8-18(17)21)26-15-4-2-14(20)3-5-15/h2-8,11-13,22H,9-10H2,1H3
45 atoms
Cl -0.678134 -0.549676 2.477177
Cl 6.805332 2.175209 1.498118
O  -3.667112 -1.453132 -0.794371
O  -3.011654 -1.968522 1.297096
O  2.492985 -0.442377 -1.472631
N  -3.46972 1.28664 -0.326151
N  -2.413613 2.090499 -0.53377
N  -3.915424 2.369577 -2.080798
C  -2.881384 -1.022601 0.280198
C  -4.178202 -2.761043 -0.515102
C  -3.472037 0.323121 0.755561
C  -4.144545 -2.77424 1.003343
C  -1.423984 -0.881442 -0.132571
C  -3.339184 -3.843038 -1.161463
C  -0.388328 -0.654129 0.770409
C  -1.07821 -0.938468 -1.480689
C  0.929069 -0.50331 0.365609
C  0.223065 -0.77587 -1.915532
C  1.231174 -0.556813 -0.987717
C  -4.381591 1.43958 -1.259448
C  -2.704577 2.752641 -1.605684
C  3.468019 0.182271 -0.739282
C  3.314857 1.490041 -0.301099
C  4.642501 -0.510629 -0.501254
C  4.344621 2.103526 0.392939
C  5.679324 0.106583 0.181751
C  5.519002 1.406431 0.631103
H  -5.200115 -2.797121 -0.896392
H  -2.906703 0.753953 1.577861
H  -4.502465 0.18207 1.082364
H  -5.056795 -2.350141 1.436165
H  -3.984167 -3.764477 1.429413
H  -3.804357 -4.815912 -0.996402
H  -2.328867 -3.880913 -0.750743
H  -3.266988 -3.693381 -2.239274
H  -1.846699 -1.105991 -2.221393
H  1.701373 -0.352593 1.108047
H  0.456837 -0.822222 -2.9712
H  -5.324065 0.923018 -1.334528
H  -2.08517 3.502866 -2.067761
H  2.401693 2.037298 -0.497089
H  4.75548 -1.527511 -0.853036
H  4.227853 3.121314 0.738373
H  6.599015 -0.431689 0.363927
H  -4.389012 2.730446 -2.901817
elementType: Cl O N C H
totalener: -2045.14846450 hartree
nucrepener: 2784.63040441 hartree
electener: -4829.77886891 hartree
oneelecener: -8317.42158545 hartree
twoeener: 3487.64271654 hartree
cpcmener: -0.10868676 hartree
kineticenergy: 2039.04359278 hartree
xcener: -150.073020336873 hartree
chargesum: 1.0000000
charge: -0.071708 -0.093281 -0.425779 -0.366340 -0.316069 0.136724 -0.295626 -0.093188 0.644591 0.167250 -0.146458 0.008004 -0.171966 -0.305196 -0.023879 -0.089109 -0.159206 -0.269355 0.302001 0.187774 0.156146 0.269393 -0.193826 -0.232166 -0.125070 -0.111957 0.069414 0.089143 0.142502 0.144420 0.090927 0.103888 0.104390 0.096601 0.093630 0.145125 0.131577 0.146895 0.216193 0.199848 0.158513 0.149250 0.146026 0.145807 0.244145
qa: -0.0717 -0.0933 -0.4258 -0.3663 -0.3161 0.1367 -0.2956 -0.0932 0.6446 0.1673 -0.1465 0.0080 -0.1720 -0.3052 -0.0239 -0.0891 -0.1592 -0.2694 0.3020 0.1878 0.1561 0.2694 -0.1938 -0.2322 -0.1251 -0.1120 0.0694 0.0891 0.1425 0.1444 0.0909 0.1039 0.1044 0.0966 0.0936 0.1451 0.1316 0.1469 0.2162 0.1998 0.1585 0.1493 0.1460 0.1458 0.2441
va: 1.2562 1.2095 1.9661 2.0077 2.0965 3.4278 2.8884 3.5647 3.7598 3.9230 3.8900 3.9963 3.5350 3.9528 4.0605 3.7969 3.9699 4.0931 3.7805 3.9259 3.9314 3.7085 3.9744 4.0433 3.9587 3.9495 3.8571 1.0000 1.0280 1.0005 0.9974 0.9928 1.0085 0.9997 1.0069 1.0242 1.0256 1.0087 0.9758 0.9777 0.9957 1.0047 1.0033 1.0023 0.9673
dispersion: -0.025650530 hartree
energy: -2045.174115031394 hartree
dipole: -31.53572 22.76243 -8.77329 -13.69800 15.86564 2.16763 -14.72291 11.08042 -3.64249
magnitude: 9.74356 au
magnitude: 24.76617 debye
