program: Orca
programVersion: 5.0.2
elementType: Cl Cl O O O N N N C C C C C C C C C C C C C C C C C C C H H H H H H H H H H H H H H H H H H
charge: 1
multiplicity: 1
keywords: wb97x-d3
keywords: def2-TZVPP
keywords: def2/J RIJCOSX
keywords: DEFGRID2
keywords: scfconv7
keywords: smallprint printgap noloewdin
keywords: NOSOSCF
formula: C19H18Cl2N3O3
InChI: InChI=1/C19H18Cl2N3O3/c1-13-9-25-19(27-13,10-24-12-22-11-23-24)17-7-6-16(8-18(17)21)26-15-4-2-14(20)3-5-15/h2-8,11-13,22H,9-10H2,1H3
45 atoms
Cl -0.652853 -0.543899 2.462219
Cl 6.851737 2.068165 1.557562
O  -3.652953 -1.44007 -0.799282
O  -2.971281 -1.978846 1.277565
O  2.490991 -0.355427 -1.506775
N  -3.521776 1.281629 -0.301885
N  -2.487503 2.104881 -0.541546
N  -4.035636 2.346709 -2.048685
C  -2.864508 -1.014698 0.275412
C  -4.154819 -2.753931 -0.531971
C  -3.471632 0.315259 0.775848
C  -4.099944 -2.790736 0.985725
C  -1.412795 -0.847574 -0.146756
C  -3.320637 -3.821234 -1.207991
C  -0.373078 -0.625178 0.752453
C  -1.0758 -0.878779 -1.49805
C  0.940571 -0.457537 0.341767
C  0.221055 -0.69819 -1.938712
C  1.234339 -0.487802 -1.013994
C  -4.462001 1.413043 -1.209972
C  -2.819301 2.754384 -1.609394
C  3.479316 0.221503 -0.75178
C  3.357141 1.5208 -0.28013
C  4.633549 -0.508379 -0.524808
C  4.397804 2.08902 0.435708
C  5.681742 0.063586 0.180205
C  5.552116 1.355219 0.662613
H  -5.182126 -2.788969 -0.898687
H  -2.894079 0.755833 1.584352
H  -4.489097 0.14884 1.130003
H  -5.010431 -2.383172 1.437786
H  -3.92392 -3.78602 1.393456
H  -2.303637 -3.859305 -0.814138
H  -3.266662 -3.654162 -2.284326
H  -3.777786 -4.799213 -1.05089
H  -1.847845 -1.040597 -2.23641
H  1.715738 -0.312201 1.082185
H  0.447721 -0.724875 -2.996613
H  -5.396465 0.879042 -1.25692
H  -2.227085 3.51337 -2.092263
H  2.459638 2.096428 -0.467627
H  4.722234 -1.518581 -0.902303
H  4.305242 3.100427 0.806525
H  6.585525 -0.503825 0.354219
H  -4.53839 2.693996 -2.858116
elementType: Cl O N C H
totalener: -2045.14840052 hartree
nucrepener: 2782.35467523 hartree
electener: -4827.50307576 hartree
oneelecener: -8312.91819815 hartree
twoeener: 3485.41512240 hartree
cpcmener: -0.10860501 hartree
kineticenergy: 2039.04060886 hartree
xcener: -150.072426734782 hartree
chargesum: 1.0000000
charge: -0.072167 -0.093067 -0.427269 -0.365913 -0.315579 0.136253 -0.296557 -0.092721 0.646657 0.167387 -0.143710 0.008334 -0.170314 -0.305032 -0.027993 -0.092259 -0.160571 -0.266996 0.304982 0.187462 0.155791 0.266879 -0.194400 -0.227423 -0.125156 -0.114284 0.071295 0.088689 0.142069 0.144394 0.090881 0.103996 0.096404 0.093556 0.104147 0.145050 0.130889 0.146801 0.216066 0.199668 0.158905 0.149177 0.145657 0.145974 0.244047
qa: -0.0722 -0.0931 -0.4273 -0.3659 -0.3156 0.1363 -0.2966 -0.0927 0.6467 0.1674 -0.1437 0.0083 -0.1703 -0.3050 -0.0280 -0.0923 -0.1606 -0.2670 0.3050 0.1875 0.1558 0.2669 -0.1944 -0.2274 -0.1252 -0.1143 0.0713 0.0887 0.1421 0.1444 0.0909 0.1040 0.0964 0.0936 0.1041 0.1450 0.1309 0.1468 0.2161 0.1997 0.1589 0.1492 0.1457 0.1460 0.2440
va: 1.2558 1.2098 1.9636 2.0072 2.0978 3.4290 2.8902 3.5645 3.7563 3.9227 3.8891 3.9955 3.5345 3.9528 4.0702 3.7992 3.9678 4.0899 3.7805 3.9271 3.9322 3.7093 3.9776 4.0415 3.9584 3.9501 3.8559 1.0001 1.0283 0.9997 0.9975 0.9928 1.0000 1.0069 1.0084 1.0243 1.0264 1.0087 0.9756 0.9778 0.9953 1.0045 1.0035 1.0023 0.9673
dispersion: -0.025603507 hartree
energy: -2045.174004030839 hartree
dipole: -31.72698 22.79655 -8.93044 -13.49318 15.61495 2.12177 -14.86263 11.29256 -3.57007
magnitude: 9.84886 au
magnitude: 25.03381 debye
