program: Orca
programVersion: 5.0.2
elementType: Cl Cl O O O N N N C C C C C C C C C C C C C C C C C C C H H H H H H H H H H H H H H H H H H
charge: 1
multiplicity: 1
keywords: wb97x-d3
keywords: def2-TZVPP
keywords: def2/J RIJCOSX
keywords: DEFGRID2
keywords: scfconv7
keywords: smallprint printgap noloewdin
keywords: NOSOSCF
formula: C19H18Cl2N3O3
InChI: InChI=1/C19H18Cl2N3O3/c1-13-9-25-19(27-13,10-24-12-22-11-23-24)17-7-6-16(8-18(17)21)26-15-4-2-14(20)3-5-15/h2-8,11-13,22H,9-10H2,1H3
45 atoms
Cl -0.399495 -1.821627 -1.760565
Cl 7.097306 1.196028 -1.300711
O  -2.957058 -2.435302 -0.35152
O  -3.836089 -0.858724 0.992949
O  2.152342 0.729729 1.798326
N  -3.445826 1.110321 -1.01214
N  -2.379578 1.898655 -1.22732
N  -4.00308 3.021821 -0.316923
C  -2.915289 -1.077918 -0.038076
C  -3.619052 -3.12836 0.709212
C  -3.39127 -0.309967 -1.28909
C  -4.5718 -2.057202 1.208884
C  -1.535851 -0.621773 0.419274
C  -2.64787 -3.634721 1.756483
C  -0.370941 -0.901578 -0.290248
C  -1.394248 0.133174 1.581836
C  0.877494 -0.469154 0.131438
C  -0.166776 0.591442 2.018219
C  0.975592 0.28735 1.290253
C  -4.432507 1.775676 -0.455687
C  -2.73694 3.065513 -0.800295
C  3.277148 0.808289 1.01866
C  3.30167 1.573278 -0.139472
C  4.41687 0.157623 1.462304
C  4.479418 1.684573 -0.860154
C  5.599835 0.279187 0.749298
C  5.621516 1.039893 -0.408479
H  -4.154228 -3.965245 0.257672
H  -4.391152 -0.643692 -1.565626
H  -2.734208 -0.45168 -2.143428
H  -5.508666 -2.04723 0.642779
H  -4.804573 -2.13723 2.270986
H  -3.178651 -4.251476 2.482885
H  -2.161684 -2.823269 2.300428
H  -1.873591 -4.253465 1.301828
H  -2.267674 0.377168 2.169356
H  1.755068 -0.734041 -0.443121
H  -0.092271 1.176376 2.925799
H  -5.400422 1.390288 -0.180408
H  -2.129464 3.954478 -0.821321
H  2.413484 2.088509 -0.48344
H  4.388097 -0.434376 2.368165
H  4.501891 2.279467 -1.76317
H  6.49232 -0.222092 1.098763
H  -4.532999 3.793911 0.072308
elementType: Cl O N C H
totalener: -2045.14819153 hartree
nucrepener: 2791.32059580 hartree
electener: -4836.46878733 hartree
oneelecener: -8330.80189473 hartree
twoeener: 3494.33310740 hartree
cpcmener: -0.10799359 hartree
kineticenergy: 2039.03221161 hartree
xcener: -150.071508200936 hartree
chargesum: 1.0000000
charge: -0.070991 -0.093172 -0.372008 -0.407157 -0.314394 0.133732 -0.292691 -0.094097 0.556253 0.193059 -0.132519 -0.004035 -0.182611 -0.304552 0.039336 -0.106198 -0.172851 -0.270270 0.320195 0.187851 0.154980 0.276859 -0.202934 -0.233514 -0.121658 -0.109815 0.068158 0.096202 0.140629 0.147926 0.094232 0.103483 0.101705 0.094439 0.094520 0.143817 0.129489 0.147096 0.218247 0.199925 0.159074 0.149258 0.144898 0.145750 0.244351
qa: -0.0710 -0.0932 -0.3720 -0.4072 -0.3144 0.1337 -0.2927 -0.0941 0.5563 0.1931 -0.1325 -0.0040 -0.1826 -0.3046 0.0393 -0.1062 -0.1729 -0.2703 0.3202 0.1879 0.1550 0.2769 -0.2029 -0.2335 -0.1217 -0.1098 0.0682 0.0962 0.1406 0.1479 0.0942 0.1035 0.1017 0.0944 0.0945 0.1438 0.1295 0.1471 0.2182 0.1999 0.1591 0.1493 0.1449 0.1458 0.2444
va: 1.2559 1.2096 2.0129 1.9571 2.1002 3.4243 2.8925 3.5654 3.9080 3.8947 3.8515 3.9851 3.5164 3.9590 3.9801 3.8242 3.9887 4.0834 3.7637 3.9248 3.9325 3.6991 3.9807 4.0467 3.9574 3.9477 3.8561 0.9966 1.0105 1.0238 0.9999 0.9923 1.0088 0.9962 1.0109 1.0260 1.0278 1.0078 0.9739 0.9777 0.9955 1.0048 1.0036 1.0022 0.9671
dispersion: -0.025934776 hartree
energy: -2045.174126304827 hartree
dipole: -31.70868 22.82971 -8.87897 -5.80447 9.31586 3.51139 13.89816 -13.41866 0.47951
magnitude: 9.56012 au
magnitude: 24.29989 debye
