program: Orca
programVersion: 5.0.2
elementType: Cl Cl O O O N N N C C C C C C C C C C C C C C C C C C C H H H H H H H H H H H H H H H H H H
charge: 1
multiplicity: 1
keywords: wb97x-d3
keywords: def2-TZVPP
keywords: def2/J RIJCOSX
keywords: DEFGRID2
keywords: scfconv7
keywords: smallprint printgap noloewdin
keywords: NOSOSCF
formula: C19H18Cl2N3O3
InChI: InChI=1/C19H18Cl2N3O3/c1-13-9-25-19(27-13,10-24-12-22-11-23-24)17-7-6-16(8-18(17)21)26-15-4-2-14(20)3-5-15/h2-8,11-13,22H,9-10H2,1H3
45 atoms
Cl -0.461233 -1.741335 -1.873098
Cl 7.118302 1.019862 -1.017875
O  -3.098957 -2.278866 -0.636733
O  -3.980757 -0.824607 0.791626
O  2.044045 0.584979 1.870157
N  -3.536159 1.312709 -0.974562
N  -2.470274 2.126959 -1.050917
N  -4.164607 3.148375 -0.149088
C  -3.020337 -0.958966 -0.210615
C  -3.488401 -3.087849 0.475791
C  -3.451198 -0.073228 -1.387091
C  -4.016043 -2.060986 1.491686
C  -1.634157 -0.585565 0.309981
C  -2.343565 -3.927993 0.996682
C  -0.453342 -0.884693 -0.364404
C  -1.510345 0.132601 1.497487
C  0.792884 -0.512536 0.117407
C  -0.285157 0.529211 1.996782
C  0.87251 0.202772 1.3038
C  -4.565956 1.916578 -0.426186
C  -2.8713 3.24724 -0.545021
C  3.198707 0.657635 1.135767
C  4.29997 -0.04735 1.593232
C  3.292263 1.469359 0.013483
C  5.51327 0.066049 0.931787
C  4.500519 1.573514 -0.656218
C  5.603723 0.874032 -0.189894
H  -4.291054 -3.740402 0.124694
H  -4.433298 -0.384574 -1.741331
H  -2.748984 -0.128117 -2.21562
H  -5.044528 -2.253079 1.796627
H  -3.390192 -2.021664 2.389425
H  -1.525009 -3.314331 1.376136
H  -1.952469 -4.585076 0.219474
H  -2.693973 -4.560009 1.814547
H  -2.397976 0.401825 2.053187
H  1.682028 -0.788693 -0.433753
H  -0.226204 1.086663 2.922502
H  -5.543601 1.498546 -0.249224
H  -2.277391 4.14034 -0.447743
H  4.218007 -0.675524 2.470978
H  2.435023 2.027951 -0.341322
H  6.375225 -0.478195 1.293294
H  4.576398 2.206448 -1.529991
H  -4.730126 3.876996 0.272716
elementType: Cl O N C H
totalener: -2045.14792467 hartree
nucrepener: 2793.85224204 hartree
electener: -4839.00016672 hartree
oneelecener: -8335.75200520 hartree
twoeener: 3496.75183848 hartree
cpcmener: -0.10683711 hartree
kineticenergy: 2039.03015285 hartree
xcener: -150.071103977820 hartree
chargesum: 1.0000000
charge: -0.071110 -0.093364 -0.371861 -0.396263 -0.314309 0.127718 -0.297200 -0.093517 0.623108 0.206304 -0.074319 -0.058018 -0.279806 -0.303263 0.016816 -0.079173 -0.163727 -0.288684 0.321494 0.191170 0.158387 0.274520 -0.233806 -0.201149 -0.110275 -0.122298 0.068766 0.092103 0.138380 0.147334 0.112328 0.100903 0.085739 0.093480 0.105525 0.148810 0.129823 0.146850 0.217502 0.200080 0.149567 0.159708 0.145812 0.145287 0.244627
qa: -0.0711 -0.0934 -0.3719 -0.3963 -0.3143 0.1277 -0.2972 -0.0935 0.6231 0.2063 -0.0743 -0.0580 -0.2798 -0.3033 0.0168 -0.0792 -0.1637 -0.2887 0.3215 0.1912 0.1584 0.2745 -0.2338 -0.2011 -0.1103 -0.1223 0.0688 0.0921 0.1384 0.1473 0.1123 0.1009 0.0857 0.0935 0.1055 0.1488 0.1298 0.1469 0.2175 0.2001 0.1496 0.1597 0.1458 0.1453 0.2446
va: 1.2542 1.2093 2.0079 1.9746 2.0997 3.4384 2.8872 3.5656 3.8325 3.8336 3.7760 3.9691 3.5577 3.9775 4.0007 3.8103 3.9815 4.0999 3.7622 3.9209 3.9286 3.7014 4.0474 3.9807 3.9489 3.9571 3.8560 0.9995 1.0210 1.0221 1.0000 0.9947 0.9963 1.0086 1.0083 1.0174 1.0277 1.0088 0.9755 0.9774 1.0047 0.9951 1.0022 1.0034 0.9669
dispersion: -0.026087243 hartree
energy: -2045.174011917362 hartree
dipole: -29.53733 20.97500 -8.56233 -6.28291 10.07174 3.78883 12.84438 -12.04009 0.80428
magnitude: 9.39764 au
magnitude: 23.88690 debye
