program: Orca
programVersion: 5.0.2
elementType: Cl Cl O O O N N N C C C C C C C C C C C C C C C C C C C H H H H H H H H H H H H H H H H H H
charge: 1
multiplicity: 1
keywords: wb97x-d3
keywords: def2-TZVPP
keywords: def2/J RIJCOSX
keywords: DEFGRID2
keywords: scfconv7
keywords: smallprint printgap noloewdin
keywords: NOSOSCF
formula: C19H18Cl2N3O3
InChI: InChI=1/C19H18Cl2N3O3/c1-13-9-25-19(27-13,10-24-12-22-11-23-24)17-7-6-16(8-18(17)21)26-15-4-2-14(20)3-5-15/h2-8,11-13,22H,9-10H2,1H3
45 atoms
Cl -1.789196 2.014291 2.080246
Cl 7.765102 -0.607642 -1.519945
O  -2.62468 -1.343867 -0.820558
O  -3.339754 -0.248583 0.980066
O  2.92274 0.519855 1.568571
N  -4.310402 0.892017 -1.3246
N  -5.223963 1.557134 -0.60037
N  -6.184474 0.267208 -2.061931
C  -2.47033 -0.153094 -0.101284
C  -3.192162 -2.345571 0.036079
C  -2.900807 0.999415 -1.012976
C  -3.322137 -1.610314 1.36636
C  -1.02163 0.044229 0.335447
C  -2.336066 -3.586757 0.093705
C  -0.640033 0.970831 1.306631
C  -0.005546 -0.703222 -0.251844
C  0.680909 1.128779 1.686368
C  1.324191 -0.571668 0.112244
C  1.66342 0.347875 1.094106
C  -4.877516 0.103168 -2.208462
C  -6.365298 1.167222 -1.064549
C  4.010928 0.220824 0.792201
C  4.978857 -0.610104 1.331805
C  4.183578 0.790099 -0.461858
C  6.140775 -0.866143 0.619957
C  5.338901 0.525903 -1.179205
C  6.31187 -0.296455 -0.631052
H  -4.180401 -2.596966 -0.36122
H  -2.329195 0.966177 -1.938922
H  -2.746152 1.971582 -0.552402
H  -4.246178 -1.836581 1.896295
H  -2.476412 -1.822965 2.031316
H  -1.341419 -3.374039 0.487547
H  -2.230904 -4.045738 -0.889577
H  -2.805334 -4.322708 0.749012
H  -0.253623 -1.425567 -1.01666
H  0.953342 1.851582 2.444336
H  2.070584 -1.193808 -0.363613
H  -4.383916 -0.536355 -2.921161
H  -7.329903 1.502586 -0.723329
H  4.835919 -1.048978 2.310919
H  3.432569 1.447442 -0.881836
H  6.900188 -1.508942 1.043941
H  5.478709 0.97245 -2.154386
H  -6.906007 -0.195723 -2.603478
elementType: Cl O N C H
totalener: -2045.15099122 hartree
nucrepener: 2720.52166794 hartree
electener: -4765.67265916 hartree
oneelecener: -8189.32643680 hartree
twoeener: 3423.65377763 hartree
cpcmener: -0.10708570 hartree
kineticenergy: 2039.05002007 hartree
xcener: -150.073683920606 hartree
chargesum: 1.0000000
charge: -0.074660 -0.094110 -0.411191 -0.364630 -0.318150 0.130508 -0.283727 -0.096998 0.592263 0.138126 -0.110077 0.014960 -0.129545 -0.284520 0.026413 -0.165290 -0.228809 -0.200335 0.272311 0.180449 0.149140 0.273182 -0.238070 -0.190952 -0.111529 -0.127389 0.069170 0.083995 0.155090 0.149184 0.116234 0.091487 0.087056 0.097145 0.104754 0.153201 0.127979 0.156811 0.215431 0.200039 0.149480 0.159943 0.146341 0.145848 0.243441
qa: -0.0747 -0.0941 -0.4112 -0.3646 -0.3181 0.1305 -0.2837 -0.0970 0.5923 0.1381 -0.1101 0.0150 -0.1295 -0.2845 0.0264 -0.1653 -0.2288 -0.2003 0.2723 0.1804 0.1491 0.2732 -0.2381 -0.1910 -0.1115 -0.1274 0.0692 0.0840 0.1551 0.1492 0.1162 0.0915 0.0871 0.0971 0.1048 0.1532 0.1280 0.1568 0.2154 0.2000 0.1495 0.1599 0.1463 0.1458 0.2434
va: 1.2460 1.2085 1.9756 1.9942 2.0910 3.4618 2.9071 3.5630 3.8790 3.8974 3.7505 3.9214 3.5656 3.9728 3.9778 3.9644 4.1198 3.9734 3.8158 3.9204 3.9490 3.7050 4.0442 3.9741 3.9504 3.9612 3.8534 1.0014 1.0053 1.0245 0.9979 1.0040 1.0017 1.0041 1.0054 1.0193 1.0278 0.9995 0.9782 0.9775 1.0049 0.9940 1.0020 1.0034 0.9675
dispersion: -0.024780377 hartree
energy: -2045.175771597054 hartree
dipole: -25.16556 15.49022 -9.67533 -16.21779 15.00731 -1.21048 -4.34936 0.48305 -3.86631
magnitude: 10.48931 au
magnitude: 26.66172 debye
