program: Orca
programVersion: 5.0.2
elementType: Cl Cl O O O N N N C C C C C C C C C C C C C C C C C C C H H H H H H H H H H H H H H H H H H
charge: 1
multiplicity: 1
keywords: wb97x-d3
keywords: def2-TZVPP
keywords: def2/J RIJCOSX
keywords: DEFGRID2
keywords: scfconv7
keywords: smallprint printgap noloewdin
keywords: NOSOSCF
formula: C19H18Cl2N3O3
InChI: InChI=1/C19H18Cl2N3O3/c1-13-9-25-19(27-13,10-24-12-22-11-23-24)17-7-6-16(8-18(17)21)26-15-4-2-14(20)3-5-15/h2-8,11-13,22H,9-10H2,1H3
45 atoms
Cl -2.570601 0.883823 -1.810827
Cl 7.54166 -0.867805 0.575873
O  -3.504371 -1.39082 -0.254716
O  -2.366027 -2.249594 1.450223
O  2.286666 1.281232 -0.867096
N  -3.82662 1.071876 1.211762
N  -3.054862 2.172889 1.241158
N  -4.88463 2.532789 0.116777
C  -2.643012 -1.050948 0.785499
C  -3.22892 -2.739245 -0.65382
C  -3.389526 -0.175795 1.798059
C  -2.266974 -3.234698 0.432704
C  -1.348631 -0.399033 0.295972
C  -2.654015 -2.817764 -2.049292
C  -1.222875 0.431149 -0.816637
C  -0.190115 -0.622102 1.038219
C  -0.001053 0.963239 -1.198078
C  1.038768 -0.092969 0.692132
C  1.131709 0.694467 -0.446659
C  -4.928881 1.274183 0.525501
C  -3.716098 3.054547 0.563146
C  3.497737 0.739254 -0.506728
C  4.434664 1.578929 0.071728
C  3.798453 -0.590598 -0.766993
C  5.689562 1.0867 0.397675
C  5.046555 -1.086996 -0.42978
C  5.98242 -0.244649 0.151864
H  -4.175623 -3.2829 -0.61353
H  -2.751296 0.061779 2.646304
H  -4.270906 -0.704525 2.158987
H  -2.554058 -4.197433 0.851984
H  -1.24047 -3.307886 0.056844
H  -1.704164 -2.287305 -2.125782
H  -3.342466 -2.409397 -2.788424
H  -2.475714 -3.862464 -2.308295
H  -0.242741 -1.236455 1.926124
H  0.072715 1.59336 -2.074557
H  1.900604 -0.298473 1.312179
H  -5.722074 0.566738 0.34843
H  -3.401236 4.068158 0.382386
H  4.192414 2.615671 0.265326
H  3.070056 -1.244261 -1.229759
H  6.423988 1.740685 0.847322
H  5.283238 -2.123431 -0.627392
H  -5.594767 3.005649 -0.431692
elementType: Cl O N C H
totalener: -2045.14044228 hartree
nucrepener: 2801.59256158 hartree
electener: -4846.73300386 hartree
oneelecener: -8350.98763906 hartree
twoeener: 3504.25463520 hartree
cpcmener: -0.11467923 hartree
kineticenergy: 2039.03077834 hartree
xcener: -150.072953753458 hartree
chargesum: 1.0000000
charge: -0.081830 -0.098286 -0.388351 -0.393764 -0.329339 0.100065 -0.292154 -0.082622 0.637847 0.173428 -0.048951 -0.019894 -0.112666 -0.302512 -0.056781 -0.189385 -0.162227 -0.191129 0.257332 0.182732 0.143578 0.281178 -0.238822 -0.198225 -0.112881 -0.126368 0.068842 0.089635 0.144762 0.141536 0.116866 0.095713 0.085049 0.092790 0.108401 0.144124 0.127433 0.158531 0.216291 0.199179 0.150962 0.164667 0.147450 0.147426 0.250371
qa: -0.0818 -0.0983 -0.3884 -0.3938 -0.3293 0.1001 -0.2922 -0.0826 0.6378 0.1734 -0.0490 -0.0199 -0.1127 -0.3025 -0.0568 -0.1894 -0.1622 -0.1911 0.2573 0.1827 0.1436 0.2812 -0.2388 -0.1982 -0.1129 -0.1264 0.0688 0.0896 0.1448 0.1415 0.1169 0.0957 0.0850 0.0928 0.1084 0.1441 0.1274 0.1585 0.2163 0.1992 0.1510 0.1647 0.1475 0.1474 0.2504
va: 1.2324 1.2046 1.9920 1.9785 2.0795 3.4539 2.8773 3.5500 3.7654 3.8696 3.7898 3.9412 3.5402 3.9658 3.9292 4.0144 4.0741 3.9317 3.8221 3.9262 3.9517 3.6877 4.0465 3.9734 3.9473 3.9574 3.8404 1.0024 1.0087 1.0138 0.9974 0.9999 0.9980 1.0076 1.0086 1.0256 1.0263 0.9968 0.9776 0.9800 1.0042 0.9925 1.0016 1.0028 0.9633
dispersion: -0.026602026 hartree
energy: -2045.167044311045 hartree
dipole: -22.22483 13.50097 -8.72387 -10.40182 12.41181 2.00999 0.54670 0.08913 0.63584
magnitude: 8.97498 au
magnitude: 22.81257 debye
