program: Orca
programVersion: 5.0.2
elementType: Cl Cl O O O N N N C C C C C C C C C C C C C C C C C C C H H H H H H H H H H H H H H H H H H
charge: 1
multiplicity: 1
keywords: wb97x-d3
keywords: def2-TZVPP
keywords: def2/J RIJCOSX
keywords: DEFGRID2
keywords: scfconv7
keywords: smallprint printgap noloewdin
keywords: NOSOSCF
formula: C19H18Cl2N3O3
InChI: InChI=1/C19H18Cl2N3O3/c1-13-9-25-19(27-13,10-24-12-22-11-23-24)17-7-6-16(8-18(17)21)26-15-4-2-14(20)3-5-15/h2-8,11-13,22H,9-10H2,1H3
45 atoms
Cl -0.453787 -0.793819 2.416165
Cl 7.30174 -0.135213 0.655713
O  -3.737503 -1.177773 -0.662106
O  -2.763582 -2.164066 1.097159
O  2.026873 1.142505 -1.550316
N  -3.77067 1.312777 0.723214
N  -2.846573 2.28773 0.806659
N  -4.448996 2.848672 -0.555938
C  -2.884659 -0.948234 0.424621
C  -3.850981 -2.590232 -0.890929
C  -3.578484 0.036168 1.378184
C  -2.847208 -3.16731 0.098703
C  -1.540934 -0.418929 -0.068093
C  -3.572668 -2.938719 -2.331856
C  -0.417034 -0.315144 0.749131
C  -1.406837 0.036563 -1.377555
C  0.788247 0.191325 0.290339
C  -0.2155 0.53911 -1.866257
C  0.887247 0.609089 -1.029066
C  -4.738634 1.637573 -0.104198
C  -3.279532 3.219631 0.021236
C  3.246298 0.811869 -1.007563
C  4.101989 1.844493 -0.663194
C  3.633971 -0.51293 -0.859039
C  5.36109 1.554465 -0.159208
C  4.885809 -0.804111 -0.343376
C  5.738798 0.232011 0.005887
H  -4.868294 -2.892367 -0.625532
H  -3.00037 0.212283 2.281394
H  -4.554668 -0.353404 1.662473
H  -3.183893 -4.093565 0.560504
H  -1.871735 -3.340839 -0.370313
H  -4.28874 -2.463968 -3.002176
H  -3.662805 -4.017126 -2.467536
H  -2.565586 -2.643824 -2.629101
H  -2.254959 -0.006478 -2.045383
H  1.630853 0.260636 0.965142
H  -0.143432 0.874853 -2.892269
H  -5.607315 1.049894 -0.351646
H  -2.79584 4.165272 -0.155757
H  3.793463 2.873886 -0.790267
H  2.970453 -1.320708 -1.139972
H  6.03136 2.359346 0.108955
H  5.189483 -1.834651 -0.22094
H  -5.014387 3.395109 -1.196268
elementType: Cl O N C H
totalener: -2045.14254282 hartree
nucrepener: 2787.10400168 hartree
electener: -4832.24654450 hartree
oneelecener: -8322.23404443 hartree
twoeener: 3489.98749994 hartree
cpcmener: -0.11979895 hartree
kineticenergy: 2039.02394053 hartree
xcener: -150.070149294511 hartree
chargesum: 1.0000000
charge: -0.075378 -0.098555 -0.422069 -0.374121 -0.328319 0.127058 -0.298053 -0.087583 0.640159 0.130312 -0.105449 0.021822 -0.210704 -0.286964 0.014993 -0.104969 -0.160396 -0.280562 0.305020 0.194910 0.155585 0.276215 -0.241200 -0.192684 -0.113376 -0.128970 0.070206 0.081346 0.145765 0.141486 0.119439 0.086642 0.098653 0.104000 0.085169 0.152733 0.132528 0.148811 0.215659 0.199781 0.151613 0.164680 0.147691 0.148252 0.248824
qa: -0.0754 -0.0986 -0.4221 -0.3741 -0.3283 0.1271 -0.2981 -0.0876 0.6402 0.1303 -0.1054 0.0218 -0.2107 -0.2870 0.0150 -0.1050 -0.1604 -0.2806 0.3050 0.1949 0.1556 0.2762 -0.2412 -0.1927 -0.1134 -0.1290 0.0702 0.0813 0.1458 0.1415 0.1194 0.0866 0.0987 0.1040 0.0852 0.1527 0.1325 0.1488 0.2157 0.1998 0.1516 0.1647 0.1477 0.1483 0.2488
va: 1.2508 1.2042 1.9609 2.0013 2.0823 3.4307 2.8930 3.5660 3.7837 3.9408 3.8324 3.9271 3.5404 3.9542 3.9912 3.8263 3.9756 4.1060 3.7591 3.9203 3.9398 3.6938 4.0453 3.9675 3.9483 3.9587 3.8397 1.0046 1.0219 1.0163 0.9943 1.0045 1.0033 1.0063 1.0025 1.0169 1.0244 1.0077 0.9780 0.9782 1.0041 0.9916 1.0017 1.0027 0.9639
dispersion: -0.025806037 hartree
energy: -2045.168348857419 hartree
dipole: -31.86272 22.71879 -9.14393 -6.13469 9.12156 2.98687 -15.66189 13.77791 -1.88397
magnitude: 9.80215 au
magnitude: 24.91509 debye
