program: Orca
programVersion: 5.0.2
elementType: Cl Cl O O O N N N C C C C C C C C C C C C C C C C C C C H H H H H H H H H H H H H H H H H H
charge: 1
multiplicity: 1
keywords: wb97x-d3
keywords: def2-TZVPP
keywords: def2/J RIJCOSX
keywords: DEFGRID2
keywords: scfconv7
keywords: smallprint printgap noloewdin
keywords: NOSOSCF
formula: C19H18Cl2N3O3
InChI: InChI=1/C19H18Cl2N3O3/c1-13-9-25-19(27-13,10-24-12-22-11-23-24)17-7-6-16(8-18(17)21)26-15-4-2-14(20)3-5-15/h2-8,11-13,22H,9-10H2,1H3
45 atoms
Cl -2.424719 0.340427 -2.952802
Cl 6.793408 1.105885 2.091117
O  -3.769259 -1.535259 -1.051142
O  -3.129093 -1.576393 1.078228
O  2.35175 0.084866 -1.586967
N  -3.214285 1.241843 1.235795
N  -2.246706 2.142456 0.988644
N  -2.558196 1.901526 3.1297
C  -3.066147 -0.811448 -0.089124
C  -3.62299 -2.929102 -0.758374
C  -3.834036 0.489344 0.166459
C  -3.070181 -2.936044 0.674373
C  -1.616273 -0.557709 -0.496438
C  -2.723808 -3.627416 -1.75235
C  -1.247165 -0.060747 -1.745818
C  -0.587993 -0.798075 0.409581
C  0.075233 0.165536 -2.083597
C  0.745274 -0.590449 0.098661
C  1.073345 -0.109721 -1.160084
C  -3.405813 1.081467 2.525957
C  -1.859498 2.537527 2.157879
C  3.353356 0.314398 -0.674348
C  3.270846 1.354834 0.240646
C  4.482509 -0.484269 -0.741651
C  4.332329 1.595609 1.097233
C  5.550593 -0.237352 0.107552
C  5.464532 0.79768 1.024167
H  -4.62321 -3.366005 -0.795217
H  -4.857904 0.261411 0.459725
H  -3.861815 1.125773 -0.713904
H  -3.675382 -3.5258 1.360912
H  -2.042188 -3.310733 0.706301
H  -3.113677 -3.545731 -2.76679
H  -2.665812 -4.688851 -1.506613
H  -1.71012 -3.224466 -1.733928
H  -0.824799 -1.170288 1.396669
H  0.335412 0.551215 -3.060532
H  1.504274 -0.81432 0.835983
H  -4.122886 0.431546 3.000069
H  -1.095745 3.271699 2.348721
H  2.391167 1.984041 0.288588
H  4.536688 -1.292259 -1.459511
H  4.273636 2.406966 1.809723
H  6.43574 -0.855838 0.052465
H  -2.466981 2.02971 4.131522
elementType: Cl O N C H
totalener: -2045.14194754 hartree
nucrepener: 2795.62317263 hartree
electener: -4840.76512017 hartree
oneelecener: -8338.72482168 hartree
twoeener: 3497.95970151 hartree
cpcmener: -0.12221917 hartree
kineticenergy: 2039.02797028 hartree
xcener: -150.071143177838 hartree
chargesum: 1.0000000
charge: -0.076760 -0.098156 -0.387104 -0.404417 -0.328936 0.123769 -0.300890 -0.088095 0.637062 0.213221 -0.074944 -0.055672 -0.268441 -0.306100 0.050375 -0.104849 -0.225771 -0.217202 0.294429 0.194117 0.157977 0.277820 -0.189348 -0.239859 -0.131710 -0.113323 0.071707 0.091894 0.140564 0.146196 0.114003 0.100943 0.092741 0.105501 0.085534 0.151864 0.127545 0.157384 0.218609 0.200492 0.162563 0.151578 0.147816 0.146869 0.249004
qa: -0.0768 -0.0982 -0.3871 -0.4044 -0.3289 0.1238 -0.3009 -0.0881 0.6371 0.2132 -0.0749 -0.0557 -0.2684 -0.3061 0.0504 -0.1048 -0.2258 -0.2172 0.2944 0.1941 0.1580 0.2778 -0.1893 -0.2399 -0.1317 -0.1133 0.0717 0.0919 0.1406 0.1462 0.1140 0.1009 0.0927 0.1055 0.0855 0.1519 0.1275 0.1574 0.2186 0.2005 0.1626 0.1516 0.1478 0.1469 0.2490
va: 1.2445 1.2045 1.9954 1.9666 2.0781 3.4412 2.8908 3.5679 3.7923 3.8269 3.7859 3.9668 3.5786 3.9789 3.9346 3.8423 4.1466 3.9912 3.7768 3.9178 3.9335 3.6901 3.9710 4.0449 3.9603 3.9487 3.8371 1.0007 1.0207 1.0222 1.0007 0.9953 1.0077 1.0080 0.9964 1.0176 1.0281 0.9983 0.9754 0.9776 0.9940 1.0039 1.0027 1.0019 0.9639
dispersion: -0.026121158 hartree
energy: -2045.168068697907 hartree
dipole: -20.38214 14.93733 -5.44481 -15.02631 16.14123 1.11492 4.83203 0.77418 5.60621
magnitude: 7.89421 au
magnitude: 20.06549 debye
