program: Orca
programVersion: 5.0.2
elementType: Cl Cl O O O N N N C C C C C C C C C C C C C C C C C C C H H H H H H H H H H H H H H H H H H
charge: 1
multiplicity: 1
keywords: wb97x-d3
keywords: def2-TZVPP
keywords: def2/J RIJCOSX
keywords: DEFGRID2
keywords: scfconv7
keywords: smallprint printgap noloewdin
keywords: NOSOSCF
formula: C19H18Cl2N3O3
InChI: InChI=1/C19H18Cl2N3O3/c1-13-9-25-19(27-13,10-24-12-22-11-23-24)17-7-6-16(8-18(17)21)26-15-4-2-14(20)3-5-15/h2-8,11-13,22H,9-10H2,1H3
45 atoms
Cl -2.251541 0.093594 -3.019914
Cl 7.323114 -0.051766 1.502286
O  -3.343108 -1.79222 -1.024988
O  -2.898786 -1.50058 1.167269
O  2.314062 1.073583 -1.318188
N  -3.504756 1.230378 1.041304
N  -2.692062 2.272025 0.78355
N  -3.089059 2.104728 2.917811
C  -2.889684 -0.864809 -0.082648
C  -3.85117 -2.942035 -0.34025
C  -3.892674 0.301934 -0.000657
C  -3.065091 -2.895091 0.953115
C  -1.489193 -0.380992 -0.433433
C  -3.631516 -4.177052 -1.174576
C  -1.122763 0.05986 -1.704659
C  -0.516166 -0.30515 0.55862
C  0.154456 0.51268 -1.983571
C  0.765311 0.160858 0.314172
C  1.100729 0.562153 -0.969924
C  -3.743296 1.114562 2.328483
C  -2.45118 2.795993 1.941563
C  3.445471 0.77078 -0.601959
C  4.282461 1.823156 -0.266804
C  3.792231 -0.536976 -0.291071
C  5.482873 1.570896 0.378609
C  4.98625 -0.789142 0.365692
C  5.824191 0.265915 0.693767
H  -4.920577 -2.806766 -0.140215
H  -4.885057 -0.080042 0.237819
H  -3.952332 0.856681 -0.933534
H  -3.600884 -3.319741 1.80057
H  -2.095056 -3.395419 0.855527
H  -2.572671 -4.331318 -1.384817
H  -4.171005 -4.118803 -2.119653
H  -4.003198 -5.050388 -0.638404
H  -0.758919 -0.609359 1.566738
H  0.416195 0.837615 -2.98199
H  1.475656 0.211757 1.128297
H  -4.364822 0.379019 2.811939
H  -1.837225 3.66188 2.121494
H  4.006399 2.839135 -0.517048
H  3.148224 -1.364141 -0.560815
H  6.13885 2.391738 0.633598
H  5.259533 -1.807255 0.606892
H  -3.08198 2.302105 3.912781
elementType: Cl O N C H
totalener: -2045.14285237 hartree
nucrepener: 2757.99826138 hartree
electener: -4803.14111375 hartree
oneelecener: -8264.02856603 hartree
twoeener: 3460.88745228 hartree
cpcmener: -0.12274582 hartree
kineticenergy: 2039.00411469 hartree
xcener: -150.065489586506 hartree
chargesum: 1.0000000
charge: -0.077489 -0.098972 -0.390924 -0.422031 -0.327669 0.123020 -0.300547 -0.087708 0.677573 0.146586 -0.131669 0.019147 -0.177172 -0.272759 0.007764 -0.099795 -0.234318 -0.225681 0.310725 0.194892 0.155019 0.306012 -0.254882 -0.214471 -0.106251 -0.122312 0.062765 0.075221 0.147708 0.139358 0.110036 0.084311 0.082051 0.098131 0.095833 0.146396 0.128094 0.158448 0.217323 0.200190 0.150315 0.163753 0.147196 0.147895 0.248888
qa: -0.0775 -0.0990 -0.3909 -0.4220 -0.3277 0.1230 -0.3005 -0.0877 0.6776 0.1466 -0.1317 0.0191 -0.1772 -0.2728 0.0078 -0.0998 -0.2343 -0.2257 0.3107 0.1949 0.1550 0.3060 -0.2549 -0.2145 -0.1063 -0.1223 0.0628 0.0752 0.1477 0.1394 0.1100 0.0843 0.0821 0.0981 0.0958 0.1464 0.1281 0.1584 0.2173 0.2002 0.1503 0.1638 0.1472 0.1479 0.2489
va: 1.2440 1.2036 2.0050 1.9565 2.0837 3.4369 2.8905 3.5667 3.6764 3.9345 3.9066 3.9496 3.6543 3.9546 4.0082 3.8286 4.1363 3.9910 3.7689 3.9195 3.9373 3.6647 4.0514 3.9770 3.9444 3.9524 3.8431 1.0012 1.0009 1.0238 0.9981 1.0009 1.0100 1.0026 1.0049 1.0253 1.0275 0.9974 0.9760 0.9782 1.0054 0.9931 1.0017 1.0025 0.9640
dispersion: -0.024850007 hartree
energy: -2045.167702377466 hartree
dipole: -25.67140 18.74347 -6.92792 -12.47670 13.97705 1.50035 8.17277 -2.53528 5.63749
magnitude: 9.05695 au
magnitude: 23.02095 debye
