program: Orca
programVersion: 5.0.2
elementType: Cl Cl O O O N N N C C C C C C C C C C C C C C C C C C C H H H H H H H H H H H H H H H H H H
charge: 1
multiplicity: 1
keywords: wb97x-d3
keywords: def2-TZVPP
keywords: def2/J RIJCOSX
keywords: DEFGRID2
keywords: scfconv7
keywords: smallprint printgap noloewdin
keywords: NOSOSCF
formula: C19H18Cl2N3O3
InChI: InChI=1/C19H18Cl2N3O3/c1-13-9-25-19(27-13,10-24-12-22-11-23-24)17-7-6-16(8-18(17)21)26-15-4-2-14(20)3-5-15/h2-8,11-13,22H,9-10H2,1H3
45 atoms
Cl -0.342068 -1.769296 1.940441
Cl 7.04841 1.177137 1.173562
O  -3.906416 -0.992518 -0.730739
O  -3.00283 -2.394048 0.767362
O  2.082188 0.532344 -1.865632
N  -3.296145 1.229153 1.000718
N  -4.377475 1.808562 0.447452
N  -2.659878 3.145661 0.381863
C  -2.937138 -1.09098 0.275249
C  -4.371292 -2.305655 -1.076208
C  -3.318644 -0.152568 1.433364
C  -3.398977 -3.203112 -0.327822
C  -1.560707 -0.737198 -0.285551
C  -4.380463 -2.505599 -2.570707
C  -0.370315 -0.969629 0.401136
C  -1.457491 -0.060055 -1.500283
C  0.861825 -0.562339 -0.088823
C  -0.246531 0.368824 -2.007779
C  0.918514 0.115768 -1.29767
C  -2.249265 2.024513 0.955873
C  -3.971771 2.981033 0.081006
C  3.219927 0.659506 -1.101413
C  3.278782 1.577433 -0.062438
C  4.323885 -0.104839 -1.438842
C  4.459758 1.733276 0.644987
C  5.509855 0.056385 -0.737929
C  5.567431 0.973087 0.299084
H  -5.383573 -2.424535 -0.677518
H  -2.628923 -0.254163 2.268735
H  -4.323004 -0.377247 1.78694
H  -3.857875 -4.11249 0.055658
H  -2.53821 -3.476023 -0.950073
H  -4.739202 -3.509637 -2.800301
H  -3.380868 -2.39852 -2.994087
H  -5.047585 -1.799263 -3.064142
H  -2.352452 0.155151 -2.066016
H  1.758706 -0.782401 0.474662
H  -0.206432 0.89694 -2.951141
H  -1.259485 1.819368 1.332276
H  -4.578384 3.734934 -0.391364
H  2.415015 2.176933 0.196258
H  4.26725 -0.817868 -2.25091
H  4.511668 2.449765 1.453379
H  6.375756 -0.534902 -1.002415
H  -2.089347 3.967305 0.212956
elementType: Cl O N C H
totalener: -2045.14254216 hartree
nucrepener: 2791.11706591 hartree
electener: -4836.25960807 hartree
oneelecener: -8328.37785743 hartree
twoeener: 3492.11824937 hartree
cpcmener: -0.12268346 hartree
kineticenergy: 2038.99733253 hartree
xcener: -150.064740072836 hartree
chargesum: 1.0000000
charge: -0.073763 -0.096748 -0.415502 -0.375722 -0.324950 0.136615 -0.294544 -0.083275 0.602621 0.131944 -0.109980 0.023470 -0.228098 -0.282780 0.029263 -0.088754 -0.164326 -0.269569 0.314251 0.168832 0.156887 0.254550 -0.183380 -0.220175 -0.134539 -0.122916 0.080519 0.079233 0.155090 0.134334 0.120230 0.084648 0.102328 0.084288 0.098386 0.150821 0.128622 0.148776 0.221868 0.200728 0.164042 0.152333 0.146903 0.148479 0.248962
qa: -0.0738 -0.0967 -0.4155 -0.3757 -0.3249 0.1366 -0.2945 -0.0833 0.6026 0.1319 -0.1100 0.0235 -0.2281 -0.2828 0.0293 -0.0888 -0.1643 -0.2696 0.3143 0.1688 0.1569 0.2546 -0.1834 -0.2202 -0.1345 -0.1229 0.0805 0.0792 0.1551 0.1343 0.1202 0.0846 0.1023 0.0843 0.0984 0.1508 0.1286 0.1488 0.2219 0.2007 0.1640 0.1523 0.1469 0.1485 0.2490
va: 1.2514 1.2059 1.9755 1.9985 2.0852 3.4338 2.9137 3.5610 3.8892 3.9420 3.8285 3.9242 3.5882 3.9538 4.0022 3.8371 3.9738 4.0978 3.7574 3.9321 3.9420 3.7116 3.9801 4.0357 3.9646 3.9511 3.8352 1.0039 1.0114 1.0248 0.9946 1.0057 1.0059 1.0042 1.0034 1.0207 1.0290 1.0079 0.9642 0.9776 0.9930 1.0029 1.0031 1.0016 0.9639
dispersion: -0.026098671 hartree
energy: -2045.168640832772 hartree
dipole: -30.44856 25.66298 -4.78557 -4.17962 8.12915 3.94953 -14.66357 14.77829 0.11471
magnitude: 6.20594 au
magnitude: 15.77424 debye
